cocoon-dev mailing list archives

Site index · List index
Message view « Date » · « Thread »
Top « Date » · « Thread »
From Vadim Gritsenko <va...@reverycodes.com>
Subject trunk, Re: [continuum] BUILD FAILURE: Apache Cocoon
Date Wed, 26 Sep 2007 23:46:59 GMT
I'm getting same exception on trunk (but in 39 seconds! wooo-hooo!) - is it 
expected? Should I just wait for end of release process?

Vadim

Continuum@vmbuild wrote:
> [INFO] Scanning for projects...
> Downloading: 
> http://repo1.maven.org/maven2/org/apache/cocoon/cocoon/5/cocoon-5.pom
> [INFO] 
> ------------------------------------------------------------------------
> [ERROR] FATAL ERROR
> [INFO] 
> ------------------------------------------------------------------------
> [INFO] Failed to resolve artifact.
> 
> GroupId: org.apache.cocoon
> ArtifactId: cocoon
> Version: 5
> 
> Reason: Unable to download the artifact from any repository
> 
>  org.apache.cocoon:cocoon:pom:5
> 
> from the specified remote repositories:
>  central (http://repo1.maven.org/maven2)
> 
> 
> [INFO] 
> ------------------------------------------------------------------------
> [INFO] Trace
> org.apache.maven.reactor.MavenExecutionException: Cannot find parent: 
> org.apache.cocoon:cocoon for project: 
> null:cocoon-core-modules:pom:6-SNAPSHOT for project 
> null:cocoon-core-modules:pom:6-SNAPSHOT
>     at org.apache.maven.DefaultMaven.getProjects(DefaultMaven.java:378)
>     at org.apache.maven.DefaultMaven.doExecute(DefaultMaven.java:290)
>     at org.apache.maven.DefaultMaven.execute(DefaultMaven.java:125)
>     at org.apache.maven.cli.MavenCli.main(MavenCli.java:280)
>     at sun.reflect.NativeMethodAccessorImpl.invoke0(Native Method)
>     at 
> sun.reflect.NativeMethodAccessorImpl.invoke(NativeMethodAccessorImpl.java:39) 
> 
>     at 
> sun.reflect.DelegatingMethodAccessorImpl.invoke(DelegatingMethodAccessorImpl.java:25)

> 
>     at java.lang.reflect.Method.invoke(Method.java:324)
>     at org.codehaus.classworlds.Launcher.launchEnhanced(Launcher.java:315)
>     at org.codehaus.classworlds.Launcher.launch(Launcher.java:255)
>     at 
> org.codehaus.classworlds.Launcher.mainWithExitCode(Launcher.java:430)
>     at org.codehaus.classworlds.Launcher.main(Launcher.java:375)
> Caused by: org.apache.maven.project.ProjectBuildingException: Cannot 
> find parent: org.apache.cocoon:cocoon for project: 
> null:cocoon-core-modules:pom:6-SNAPSHOT for project 
> null:cocoon-core-modules:pom:6-SNAPSHOT
>     at 
> org.apache.maven.project.DefaultMavenProjectBuilder.assembleLineage(DefaultMavenProjectBuilder.java:1261)

> 
>     at 
> org.apache.maven.project.DefaultMavenProjectBuilder.buildInternal(DefaultMavenProjectBuilder.java:747)

> 
>     at 
> org.apache.maven.project.DefaultMavenProjectBuilder.buildFromSourceFileInternal(DefaultMavenProjectBuilder.java:479)

> 
>     at 
> org.apache.maven.project.DefaultMavenProjectBuilder.build(DefaultMavenProjectBuilder.java:200)

> 
>     at org.apache.maven.DefaultMaven.getProject(DefaultMaven.java:553)
>     at org.apache.maven.DefaultMaven.collectProjects(DefaultMaven.java:467)
>     at org.apache.maven.DefaultMaven.collectProjects(DefaultMaven.java:527)
>     at org.apache.maven.DefaultMaven.getProjects(DefaultMaven.java:364)
>     ... 11 more
> Caused by: org.apache.maven.project.ProjectBuildingException: POM 
> 'org.apache.cocoon:cocoon' not found in repository: Unable to download 
> the artifact from any repository
> 
>  org.apache.cocoon:cocoon:pom:5
> 
> from the specified remote repositories:
>  central (http://repo1.maven.org/maven2)
> for project org.apache.cocoon:cocoon
>     at 
> org.apache.maven.project.DefaultMavenProjectBuilder.findModelFromRepository(DefaultMavenProjectBuilder.java:573)

> 
>     at 
> org.apache.maven.project.DefaultMavenProjectBuilder.assembleLineage(DefaultMavenProjectBuilder.java:1257)

> 
>     ... 18 more
> Caused by: org.apache.maven.artifact.resolver.ArtifactNotFoundException: 
> Unable to download the artifact from any repository
> 
>  org.apache.cocoon:cocoon:pom:5
> 
> from the specified remote repositories:
>  central (http://repo1.maven.org/maven2)
> 
>     at 
> org.apache.maven.artifact.resolver.DefaultArtifactResolver.resolve(DefaultArtifactResolver.java:197)

> 
>     at 
> org.apache.maven.artifact.resolver.DefaultArtifactResolver.resolve(DefaultArtifactResolver.java:73)

> 
>     at 
> org.apache.maven.project.DefaultMavenProjectBuilder.findModelFromRepository(DefaultMavenProjectBuilder.java:526)

> 
>     ... 19 more
> Caused by: org.apache.maven.wagon.ResourceDoesNotExistException: Unable 
> to download the artifact from any repository
>     at 
> org.apache.maven.artifact.manager.DefaultWagonManager.getArtifact(DefaultWagonManager.java:324)

> 
>     at 
> org.apache.maven.artifact.resolver.DefaultArtifactResolver.resolve(DefaultArtifactResolver.java:185)

> 
>     ... 21 more
> [INFO] 
> ------------------------------------------------------------------------
> [INFO] Total time: 1 minute 3 seconds
> [INFO] Finished at: Wed Sep 26 16:07:20 PDT 2007
> [INFO] Final Memory: 68M/123M
> [INFO] 
> ------------------------------------------------------------------------

Mime
View raw message