cocoon-dev mailing list archives

Site index · List index
Message view « Date » · « Thread »
Top « Date » · « Thread »
From "Continuum@vmbuild" <...@cocoon.apache.org>
Subject [continuum] BUILD FAILURE: Apache Cocoon
Date Thu, 20 Sep 2007 07:03:32 GMT
Online report : http://vmbuild.apache.org/continuum/buildResult.action?buildId=7225&projectId=51

Build statistics:
  State: Failed
  Previous State: Failed
  Started at: Thu 20 Sep 2007 00:01:19 -0700
  Finished at: Thu 20 Sep 2007 00:01:56 -0700
  Total time: 36s
  Build Trigger: Schedule
  Build Number: 23
  Exit code: 1
  Building machine hostname: vmbuild
  Operating system : Linux(unknown)
  Java Home version : 
          java version "1.4.2_15"
          Java(TM) 2 Runtime Environment, Standard Edition (build 1.4.2_15-b02)
          Java HotSpot(TM) Client VM (build 1.4.2_15-b02, mixed mode)
        
  Builder version :
          Maven version: 2.0.7
          Java version: 1.4.2_15
          OS name: "linux" version: "2.6.20-16-server" arch: "i386"
    
****************************************************************************
SCM Changes:
****************************************************************************
Changed: reinhard @ Wed 19 Sep 2007 23:06:54 -0700
Comment: [maven-release-plugin] prepare release cocoon-5
Files changed:
  /cocoon/trunk/pom.xml ( 577562 )

Changed: reinhard @ Wed 19 Sep 2007 23:13:38 -0700
Comment: try it this way ... (the release plugin eagerly removes comments under some circumstances)
Files changed:
  /cocoon/trunk/pom.xml ( 577565 )

Changed: reinhard @ Wed 19 Sep 2007 23:14:01 -0700
Comment: SNAPSHOT mode
Files changed:
  /cocoon/trunk/pom.xml ( 577566 )

Changed: reinhard @ Wed 19 Sep 2007 23:20:09 -0700
Comment: [maven-release-plugin] prepare release cocoon-5
Files changed:
  /cocoon/trunk/pom.xml ( 577569 )

Changed: reinhard @ Wed 19 Sep 2007 23:23:39 -0700
Comment: [maven-release-plugin] prepare for next development iteration
Files changed:
  /cocoon/trunk/pom.xml ( 577571 )

Changed: reinhard @ Wed 19 Sep 2007 23:48:55 -0700
Comment: [maven-release-plugin] prepare release cocoon-blocks-modules-5
Files changed:
  /cocoon/trunk/blocks/pom.xml ( 577579 )

Changed: reinhard @ Wed 19 Sep 2007 23:51:58 -0700
Comment: [maven-release-plugin] prepare for next development iteration
Files changed:
  /cocoon/trunk/blocks/pom.xml ( 577581 )

****************************************************************************
Dependencies Changes:
****************************************************************************
No dependencies changed

****************************************************************************
Test Summary:
****************************************************************************
Tests: 2390
Failures: 1
Total time: 34875

****************************************************************************
Output:
****************************************************************************
[INFO] Scanning for projects...
Downloading: http://repo1.maven.org/maven2/org/apache/cocoon/cocoon/5/cocoon-5.pom
[INFO] ------------------------------------------------------------------------
[ERROR] FATAL ERROR
[INFO] ------------------------------------------------------------------------
[INFO] Failed to resolve artifact.

GroupId: org.apache.cocoon
ArtifactId: cocoon
Version: 5

Reason: Unable to download the artifact from any repository

  org.apache.cocoon:cocoon:pom:5

from the specified remote repositories:
  central (http://repo1.maven.org/maven2)


[INFO] ------------------------------------------------------------------------
[INFO] Trace
org.apache.maven.reactor.MavenExecutionException: Cannot find parent: org.apache.cocoon:cocoon
for project: null:cocoon-blocks-modules:pom:6-SNAPSHOT for project null:cocoon-blocks-modules:pom:6-SNAPSHOT
	at org.apache.maven.DefaultMaven.getProjects(DefaultMaven.java:378)
	at org.apache.maven.DefaultMaven.doExecute(DefaultMaven.java:290)
	at org.apache.maven.DefaultMaven.execute(DefaultMaven.java:125)
	at org.apache.maven.cli.MavenCli.main(MavenCli.java:280)
	at sun.reflect.NativeMethodAccessorImpl.invoke0(Native Method)
	at sun.reflect.NativeMethodAccessorImpl.invoke(NativeMethodAccessorImpl.java:39)
	at sun.reflect.DelegatingMethodAccessorImpl.invoke(DelegatingMethodAccessorImpl.java:25)
	at java.lang.reflect.Method.invoke(Method.java:324)
	at org.codehaus.classworlds.Launcher.launchEnhanced(Launcher.java:315)
	at org.codehaus.classworlds.Launcher.launch(Launcher.java:255)
	at org.codehaus.classworlds.Launcher.mainWithExitCode(Launcher.java:430)
	at org.codehaus.classworlds.Launcher.main(Launcher.java:375)
Caused by: org.apache.maven.project.ProjectBuildingException: Cannot find parent: org.apache.cocoon:cocoon
for project: null:cocoon-blocks-modules:pom:6-SNAPSHOT for project null:cocoon-blocks-modules:pom:6-SNAPSHOT
	at org.apache.maven.project.DefaultMavenProjectBuilder.assembleLineage(DefaultMavenProjectBuilder.java:1261)
	at org.apache.maven.project.DefaultMavenProjectBuilder.buildInternal(DefaultMavenProjectBuilder.java:747)
	at org.apache.maven.project.DefaultMavenProjectBuilder.buildFromSourceFileInternal(DefaultMavenProjectBuilder.java:479)
	at org.apache.maven.project.DefaultMavenProjectBuilder.build(DefaultMavenProjectBuilder.java:200)
	at org.apache.maven.DefaultMaven.getProject(DefaultMaven.java:553)
	at org.apache.maven.DefaultMaven.collectProjects(DefaultMaven.java:467)
	at org.apache.maven.DefaultMaven.collectProjects(DefaultMaven.java:527)
	at org.apache.maven.DefaultMaven.getProjects(DefaultMaven.java:364)
	... 11 more
Caused by: org.apache.maven.project.ProjectBuildingException: POM 'org.apache.cocoon:cocoon'
not found in repository: Unable to download the artifact from any repository

  org.apache.cocoon:cocoon:pom:5

from the specified remote repositories:
  central (http://repo1.maven.org/maven2)
 for project org.apache.cocoon:cocoon
	at org.apache.maven.project.DefaultMavenProjectBuilder.findModelFromRepository(DefaultMavenProjectBuilder.java:573)
	at org.apache.maven.project.DefaultMavenProjectBuilder.assembleLineage(DefaultMavenProjectBuilder.java:1257)
	... 18 more
Caused by: org.apache.maven.artifact.resolver.ArtifactNotFoundException: Unable to download
the artifact from any repository

  org.apache.cocoon:cocoon:pom:5

from the specified remote repositories:
  central (http://repo1.maven.org/maven2)

	at org.apache.maven.artifact.resolver.DefaultArtifactResolver.resolve(DefaultArtifactResolver.java:197)
	at org.apache.maven.artifact.resolver.DefaultArtifactResolver.resolve(DefaultArtifactResolver.java:73)
	at org.apache.maven.project.DefaultMavenProjectBuilder.findModelFromRepository(DefaultMavenProjectBuilder.java:526)
	... 19 more
Caused by: org.apache.maven.wagon.ResourceDoesNotExistException: Unable to download the artifact
from any repository
	at org.apache.maven.artifact.manager.DefaultWagonManager.getArtifact(DefaultWagonManager.java:324)
	at org.apache.maven.artifact.resolver.DefaultArtifactResolver.resolve(DefaultArtifactResolver.java:185)
	... 21 more
[INFO] ------------------------------------------------------------------------
[INFO] Total time: 4 seconds
[INFO] Finished at: Thu Sep 20 00:01:56 PDT 2007
[INFO] Final Memory: 1M/4M
[INFO] ------------------------------------------------------------------------

****************************************************************************



Mime
View raw message