cocoon-dev mailing list archives

Site index · List index
Message view « Date » · « Thread »
Top « Date » · « Thread »
From "Continuum@vmbuild" <...@cocoon.apache.org>
Subject [continuum] BUILD FAILURE: Apache Cocoon
Date Thu, 27 Sep 2007 07:05:05 GMT
Online report : http://vmbuild.apache.org/continuum/buildResult.action?buildId=8400&projectId=51

Build statistics:
  State: Failed
  Previous State: Failed
  Started at: Thu 27 Sep 2007 00:02:34 -0700
  Finished at: Thu 27 Sep 2007 00:03:09 -0700
  Total time: 34s
  Build Trigger: Schedule
  Build Number: 24
  Exit code: 1
  Building machine hostname: vmbuild
  Operating system : Linux(unknown)
  Java Home version : 
          java version "1.4.2_15"
          Java(TM) 2 Runtime Environment, Standard Edition (build 1.4.2_15-b02)
          Java HotSpot(TM) Client VM (build 1.4.2_15-b02, mixed mode)
        
  Builder version :
          Maven version: 2.0.7
          Java version: 1.4.2_15
          OS name: "linux" version: "2.6.20-16-server" arch: "i386"
    
****************************************************************************
SCM Changes:
****************************************************************************
Changed: reinhard @ Wed 26 Sep 2007 23:07:21 -0700
Comment: [maven-release-plugin] prepare release cocoon-databases-hsqldb-client-1.0.0-RC2
Files changed:
  /cocoon/trunk/blocks/cocoon-databases/cocoon-databases-hsqldb-client/pom.xml ( 579899 )

Changed: reinhard @ Wed 26 Sep 2007 23:07:39 -0700
Comment: [maven-release-plugin] prepare for next development iteration
Files changed:
  /cocoon/trunk/blocks/cocoon-databases/cocoon-databases-hsqldb-client/pom.xml ( 579901 )

Changed: reinhard @ Wed 26 Sep 2007 23:12:48 -0700
Comment: snapshot mode
Files changed:
  /cocoon/trunk/blocks/cocoon-databases/cocoon-databases-hsqldb-client/pom.xml ( 579903 )

Changed: reinhard @ Wed 26 Sep 2007 23:16:28 -0700
Comment: [maven-release-plugin] prepare release cocoon-databases-hsqldb-server-1.0.0-RC2
Files changed:
  /cocoon/trunk/blocks/cocoon-databases/cocoon-databases-hsqldb-server/pom.xml ( 579904 )

Changed: reinhard @ Wed 26 Sep 2007 23:16:41 -0700
Comment: [maven-release-plugin] prepare for next development iteration
Files changed:
  /cocoon/trunk/blocks/cocoon-databases/cocoon-databases-hsqldb-server/pom.xml ( 579906 )

Changed: reinhard @ Wed 26 Sep 2007 23:23:31 -0700
Comment: snapshot mode
Files changed:
  /cocoon/trunk/blocks/cocoon-databases/cocoon-databases-hsqldb-server/pom.xml ( 579908 )

Changed: reinhard @ Wed 26 Sep 2007 23:25:17 -0700
Comment: [maven-release-plugin] prepare release cocoon-databases-mocks-1.0.0-RC2
Files changed:
  /cocoon/trunk/blocks/cocoon-databases/cocoon-databases-mocks/pom.xml ( 579909 )

Changed: reinhard @ Wed 26 Sep 2007 23:25:33 -0700
Comment: [maven-release-plugin] prepare for next development iteration
Files changed:
  /cocoon/trunk/blocks/cocoon-databases/cocoon-databases-mocks/pom.xml ( 579911 )

Changed: reinhard @ Wed 26 Sep 2007 23:31:50 -0700
Comment: snapshot mode
Files changed:
  /cocoon/trunk/blocks/cocoon-databases/cocoon-databases-mocks/pom.xml ( 579914 )

Changed: reinhard @ Wed 26 Sep 2007 23:34:23 -0700
Comment: [maven-release-plugin] prepare release cocoon-databases-impl-1.0.0-RC2
Files changed:
  /cocoon/trunk/blocks/cocoon-databases/cocoon-databases-impl/pom.xml ( 579915 )

Changed: reinhard @ Wed 26 Sep 2007 23:34:42 -0700
Comment: [maven-release-plugin] prepare for next development iteration
Files changed:
  /cocoon/trunk/blocks/cocoon-databases/cocoon-databases-impl/pom.xml ( 579917 )

Changed: reinhard @ Wed 26 Sep 2007 23:42:26 -0700
Comment: snapshot mode
Files changed:
  /cocoon/trunk/blocks/cocoon-databases/cocoon-databases-impl/pom.xml ( 579919 )

****************************************************************************
Dependencies Changes:
****************************************************************************
No dependencies changed


****************************************************************************
Build Defintion:
****************************************************************************
POM filename: pom.xml
Goals: clean install   
Arguments: --batch-mode -P allblocks
Build Fresh: false
Always Build: false
Default Build Definition: true
Schedule: DEFAULT_SCHEDULE
Profile Name: Java 1.4, Large Memory
Description: 


****************************************************************************
Test Summary:
****************************************************************************
Tests: 2307
Failures: 0
Total time: 47661

****************************************************************************
Output:
****************************************************************************
[INFO] Scanning for projects...
Downloading: http://repo1.maven.org/maven2/org/apache/cocoon/cocoon-blocks-modules/5/cocoon-blocks-modules-5.pom
[INFO] ------------------------------------------------------------------------
[ERROR] FATAL ERROR
[INFO] ------------------------------------------------------------------------
[INFO] Failed to resolve artifact.

GroupId: org.apache.cocoon
ArtifactId: cocoon-blocks-modules
Version: 5

Reason: Unable to download the artifact from any repository

  org.apache.cocoon:cocoon-blocks-modules:pom:5

from the specified remote repositories:
  central (http://repo1.maven.org/maven2)


[INFO] ------------------------------------------------------------------------
[INFO] Trace
org.apache.maven.reactor.MavenExecutionException: Cannot find parent: org.apache.cocoon:cocoon-blocks-modules
for project: null:cocoon-databases-hsqldb-server:jar:1.0.0-RC3-SNAPSHOT for project null:cocoon-databases-hsqldb-server:jar:1.0.0-RC3-SNAPSHOT
	at org.apache.maven.DefaultMaven.getProjects(DefaultMaven.java:378)
	at org.apache.maven.DefaultMaven.doExecute(DefaultMaven.java:290)
	at org.apache.maven.DefaultMaven.execute(DefaultMaven.java:125)
	at org.apache.maven.cli.MavenCli.main(MavenCli.java:280)
	at sun.reflect.NativeMethodAccessorImpl.invoke0(Native Method)
	at sun.reflect.NativeMethodAccessorImpl.invoke(NativeMethodAccessorImpl.java:39)
	at sun.reflect.DelegatingMethodAccessorImpl.invoke(DelegatingMethodAccessorImpl.java:25)
	at java.lang.reflect.Method.invoke(Method.java:324)
	at org.codehaus.classworlds.Launcher.launchEnhanced(Launcher.java:315)
	at org.codehaus.classworlds.Launcher.launch(Launcher.java:255)
	at org.codehaus.classworlds.Launcher.mainWithExitCode(Launcher.java:430)
	at org.codehaus.classworlds.Launcher.main(Launcher.java:375)
Caused by: org.apache.maven.project.ProjectBuildingException: Cannot find parent: org.apache.cocoon:cocoon-blocks-modules
for project: null:cocoon-databases-hsqldb-server:jar:1.0.0-RC3-SNAPSHOT for project null:cocoon-databases-hsqldb-server:jar:1.0.0-RC3-SNAPSHOT
	at org.apache.maven.project.DefaultMavenProjectBuilder.assembleLineage(DefaultMavenProjectBuilder.java:1261)
	at org.apache.maven.project.DefaultMavenProjectBuilder.buildInternal(DefaultMavenProjectBuilder.java:747)
	at org.apache.maven.project.DefaultMavenProjectBuilder.buildFromSourceFileInternal(DefaultMavenProjectBuilder.java:479)
	at org.apache.maven.project.DefaultMavenProjectBuilder.build(DefaultMavenProjectBuilder.java:200)
	at org.apache.maven.DefaultMaven.getProject(DefaultMaven.java:553)
	at org.apache.maven.DefaultMaven.collectProjects(DefaultMaven.java:467)
	at org.apache.maven.DefaultMaven.collectProjects(DefaultMaven.java:527)
	at org.apache.maven.DefaultMaven.collectProjects(DefaultMaven.java:527)
	at org.apache.maven.DefaultMaven.getProjects(DefaultMaven.java:364)
	... 11 more
Caused by: org.apache.maven.project.ProjectBuildingException: POM 'org.apache.cocoon:cocoon-blocks-modules'
not found in repository: Unable to download the artifact from any repository

  org.apache.cocoon:cocoon-blocks-modules:pom:5

from the specified remote repositories:
  central (http://repo1.maven.org/maven2)
 for project org.apache.cocoon:cocoon-blocks-modules
	at org.apache.maven.project.DefaultMavenProjectBuilder.findModelFromRepository(DefaultMavenProjectBuilder.java:573)
	at org.apache.maven.project.DefaultMavenProjectBuilder.assembleLineage(DefaultMavenProjectBuilder.java:1257)
	... 19 more
Caused by: org.apache.maven.artifact.resolver.ArtifactNotFoundException: Unable to download
the artifact from any repository

  org.apache.cocoon:cocoon-blocks-modules:pom:5

from the specified remote repositories:
  central (http://repo1.maven.org/maven2)

	at org.apache.maven.artifact.resolver.DefaultArtifactResolver.resolve(DefaultArtifactResolver.java:197)
	at org.apache.maven.artifact.resolver.DefaultArtifactResolver.resolve(DefaultArtifactResolver.java:73)
	at org.apache.maven.project.DefaultMavenProjectBuilder.findModelFromRepository(DefaultMavenProjectBuilder.java:526)
	... 20 more
Caused by: org.apache.maven.wagon.ResourceDoesNotExistException: Unable to download the artifact
from any repository
	at org.apache.maven.artifact.manager.DefaultWagonManager.getArtifact(DefaultWagonManager.java:324)
	at org.apache.maven.artifact.resolver.DefaultArtifactResolver.resolve(DefaultArtifactResolver.java:185)
	... 22 more
[INFO] ------------------------------------------------------------------------
[INFO] Total time: 21 seconds
[INFO] Finished at: Thu Sep 27 00:03:09 PDT 2007
[INFO] Final Memory: 20M/37M
[INFO] ------------------------------------------------------------------------

****************************************************************************



Mime
View raw message