cocoon-dev mailing list archives

Site index · List index
Message view « Date » · « Thread »
Top « Date » · « Thread »
From "Continuum@vmbuild.apache.org" <...@cocoon.apache.org>
Subject [continuum] BUILD FAILURE: Apache Cocoon
Date Tue, 03 Jul 2007 09:32:43 GMT
Online report : http://vmbuild.apache.org/continuum/servlet/continuum/target/ProjectBuild.vm/view/ProjectBuild/id/291/buildId/204798
Build statistics:
  State: Failed
  Previous State: Ok
  Started at: Tue, 3 Jul 2007 02:29:01 -0700
  Finished at: Tue, 3 Jul 2007 02:32:42 -0700
  Total time: 3m 40s
  Build Trigger: Forced
  Exit code: 1
  Building machine hostname: vmbuild.apache.org
  Operating system : Linux(unknown)
  Java version : 1.5.0_06(Sun Microsystems Inc.)

Changes
         reinhard          break build
             /cocoon/trunk/core/cocoon-core/src/main/java/org/apache/cocoon/servlet/SitemapServlet.java
        
****************************************************************************
Output:
****************************************************************************
[INFO] Scanning for projects...
[INFO] Reactor build order: 
[INFO]   Apache Cocoon
[INFO]   Cocoon Configuration API
[INFO]   Cocoon Spring Configurator
[INFO]   Cocoon Core [modules]
[INFO]   Cocoon Pipeline API
[INFO]   Cocoon Util
[INFO]   Cocoon XML API
[INFO]   Cocoon Pipeline Implementation
[INFO]   Cocoon XML Implementation
[INFO]   Cocoon Pipeline Components
[INFO]   Cocoon Sitemap API
[INFO]   Cocoon Thread API
[INFO]   Cocoon Sitemap Implementation
[INFO]   Cocoon Sitemap Components
[INFO]   Cocoon XML Resolver
[INFO]   Cocoon Store Implementation
[INFO]   Cocoon Thread Implementation
[INFO]   Cocoon Core
[INFO]   Cocoon Servlet Service Implementation
[INFO]   Cocoon Blocks [modules]
[INFO]   Cocoon Linkrewriter Block Implementation
[INFO]   Cocoon Servlet Service Components
[INFO]   Cocoon Ajax Block Implementation
[INFO]   Cocoon Expression Language API
[INFO]   Cocoon Flowscript Block Implementation
[INFO]   Cocoon Expression Language Implementation.
[INFO]   Cocoon Template Framework Block Implementation
[INFO]   Cocoon Samples Style Default Block
[INFO]   Cocoon Ajax Block Sample
[INFO]   Cocoon Apples Block Implementation
[INFO]   Cocoon Main Core Sample Block
[INFO]   Cocoon Forms Block Implementation
[INFO]   Cocoon Apples Block Samples
[INFO]   Cocoon Additional Sample Block
[INFO]   Cocoon Forms Block Samples
[INFO]   Cocoon Linkrewriter Block Samples
[INFO]   Cocoon Template Block Samples
[INFO]   Cocoon Licenses
[INFO]   Cocoon Commons [modules]
[INFO]   Cocoon Servlet Service Sample Blocks
[INFO]   Cocoon Webapp
[INFO]   Cocoon Tools [modules]
[INFO]   Cocoon 2.2 Archetype: Block
[INFO]   Cocoon 2.2 Archetype: Block (plain)
[INFO]   Cocoon 2.2 Archetype: Web Application
[INFO]   Cocoon Maven Reports
[INFO]   Cocoon Maven 2 Plugin
[INFO]   Cocoon Reloading ClassLoader - Webapp Wrapper
[INFO]   Cocoon Reloading ClassLoader - Spring reloader
[INFO]   Cocoon Distributions [modules]
[INFO] ----------------------------------------------------------------------------
[INFO] Building Apache Cocoon
[INFO]    task-segment: [clean, install]
[INFO] ----------------------------------------------------------------------------
[INFO] [clean:clean]
[INFO] Deleting directory /x1/continuum/working-directory/291/target
[INFO] Deleting directory /x1/continuum/working-directory/291/target/classes
[INFO] Deleting directory /x1/continuum/working-directory/291/target/test-classes
[INFO] Deleting directory /x1/continuum/working-directory/291/target/site
[INFO] [enforcer:enforce-once {execution: enforce-maven}]
[INFO] [site:attach-descriptor]
[INFO] [install:install]
[INFO] Installing /x1/continuum/working-directory/291/pom.xml to /home/continuum/.m2/repository/org/apache/cocoon/cocoon/5-SNAPSHOT/cocoon-5-SNAPSHOT.pom
[INFO] ----------------------------------------------------------------------------
[INFO] Building Cocoon Configuration API
[INFO]    task-segment: [clean, install]
[INFO] ----------------------------------------------------------------------------
[INFO] [clean:clean]
[INFO] Deleting directory /x1/continuum/working-directory/291/core/cocoon-configuration/cocoon-configuration-api/target
[INFO] Deleting directory /x1/continuum/working-directory/291/core/cocoon-configuration/cocoon-configuration-api/target/classes
[INFO] Deleting directory /x1/continuum/working-directory/291/core/cocoon-configuration/cocoon-configuration-api/target/test-classes
[INFO] Deleting directory /x1/continuum/working-directory/291/core/cocoon-configuration/cocoon-configuration-api/target/site
[INFO] [enforcer:enforce-once {execution: enforce-maven}]
[INFO] [resources:resources]
[INFO] Using default encoding to copy filtered resources.
[INFO] [compiler:compile]
[INFO] Compiling 5 source files to /x1/continuum/working-directory/291/core/cocoon-configuration/cocoon-configuration-api/target/classes
[INFO] [resources:testResources]
[INFO] Using default encoding to copy filtered resources.
[INFO] [compiler:testCompile]
[INFO] No sources to compile
[INFO] [surefire:test]
[INFO] No tests to run.
[INFO] [jar:jar]
[INFO] Building jar: /x1/continuum/working-directory/291/core/cocoon-configuration/cocoon-configuration-api/target/cocoon-configuration-api-1.0.1-SNAPSHOT.jar
[INFO] [install:install]
[INFO] Installing /x1/continuum/working-directory/291/core/cocoon-configuration/cocoon-configuration-api/target/cocoon-configuration-api-1.0.1-SNAPSHOT.jar
to /home/continuum/.m2/repository/org/apache/cocoon/cocoon-configuration-api/1.0.1-SNAPSHOT/cocoon-configuration-api-1.0.1-SNAPSHOT.jar
[INFO] ----------------------------------------------------------------------------
[INFO] Building Cocoon Spring Configurator
[INFO]    task-segment: [clean, install]
[INFO] ----------------------------------------------------------------------------
[INFO] [clean:clean]
[INFO] Deleting directory /x1/continuum/working-directory/291/core/cocoon-configuration/cocoon-spring-configurator/target
[INFO] Deleting directory /x1/continuum/working-directory/291/core/cocoon-configuration/cocoon-spring-configurator/target/classes
[INFO] Deleting directory /x1/continuum/working-directory/291/core/cocoon-configuration/cocoon-spring-configurator/target/test-classes
[INFO] Deleting directory /x1/continuum/working-directory/291/core/cocoon-configuration/cocoon-spring-configurator/target/site
[INFO] [enforcer:enforce-once {execution: enforce-maven}]
[INFO] [resources:resources]
[INFO] Using default encoding to copy filtered resources.
[INFO] [compiler:compile]
[INFO] Compiling 22 source files to /x1/continuum/working-directory/291/core/cocoon-configuration/cocoon-spring-configurator/target/classes
[INFO] [resources:testResources]
[INFO] Using default encoding to copy filtered resources.
[INFO] [compiler:testCompile]
[INFO] No sources to compile
[INFO] [surefire:test]
[INFO] No tests to run.
[INFO] [jar:jar]
[INFO] Building jar: /x1/continuum/working-directory/291/core/cocoon-configuration/cocoon-spring-configurator/target/cocoon-spring-configurator-1.0.1-SNAPSHOT.jar
[INFO] [install:install]
[INFO] Installing /x1/continuum/working-directory/291/core/cocoon-configuration/cocoon-spring-configurator/target/cocoon-spring-configurator-1.0.1-SNAPSHOT.jar
to /home/continuum/.m2/repository/org/apache/cocoon/cocoon-spring-configurator/1.0.1-SNAPSHOT/cocoon-spring-configurator-1.0.1-SNAPSHOT.jar
[INFO] ----------------------------------------------------------------------------
[INFO] Building Cocoon Core [modules]
[INFO]    task-segment: [clean, install]
[INFO] ----------------------------------------------------------------------------
[INFO] [clean:clean]
[INFO] Deleting directory /x1/continuum/working-directory/291/core/target
[INFO] Deleting directory /x1/continuum/working-directory/291/core/target/classes
[INFO] Deleting directory /x1/continuum/working-directory/291/core/target/test-classes
[INFO] Deleting directory /x1/continuum/working-directory/291/core/target/site
[INFO] [enforcer:enforce-once {execution: enforce-maven}]
[INFO] [site:attach-descriptor]
[INFO] [install:install]
[INFO] Installing /x1/continuum/working-directory/291/core/pom.xml to /home/continuum/.m2/repository/org/apache/cocoon/cocoon-core-modules/5-SNAPSHOT/cocoon-core-modules-5-SNAPSHOT.pom
[INFO] ----------------------------------------------------------------------------
[INFO] Building Cocoon Pipeline API
[INFO]    task-segment: [clean, install]
[INFO] ----------------------------------------------------------------------------
[INFO] [clean:clean]
[INFO] Deleting directory /x1/continuum/working-directory/291/core/cocoon-pipeline/cocoon-pipeline-api/target
[INFO] Deleting directory /x1/continuum/working-directory/291/core/cocoon-pipeline/cocoon-pipeline-api/target/classes
[INFO] Deleting directory /x1/continuum/working-directory/291/core/cocoon-pipeline/cocoon-pipeline-api/target/test-classes
[INFO] Deleting directory /x1/continuum/working-directory/291/core/cocoon-pipeline/cocoon-pipeline-api/target/site
[INFO] [enforcer:enforce-once {execution: enforce-maven}]
[INFO] [resources:resources]
[INFO] Using default encoding to copy filtered resources.
[INFO] [compiler:compile]
[INFO] Compiling 45 source files to /x1/continuum/working-directory/291/core/cocoon-pipeline/cocoon-pipeline-api/target/classes
[INFO] [resources:testResources]
[INFO] Using default encoding to copy filtered resources.
[INFO] [compiler:testCompile]
[INFO] Compiling 1 source file to /x1/continuum/working-directory/291/core/cocoon-pipeline/cocoon-pipeline-api/target/test-classes
[INFO] [surefire:test]
[INFO] Surefire report directory: /x1/continuum/working-directory/291/core/cocoon-pipeline/cocoon-pipeline-api/target/surefire-reports

-------------------------------------------------------
 T E S T S
-------------------------------------------------------
Running org.apache.cocoon.util.location.LocationTestCase
Tests run: 3, Failures: 0, Errors: 0, Skipped: 0, Time elapsed: 0.244 sec

Results :
Tests run: 3, Failures: 0, Errors: 0, Skipped: 0

[INFO] [jar:jar]
[INFO] Building jar: /x1/continuum/working-directory/291/core/cocoon-pipeline/cocoon-pipeline-api/target/cocoon-pipeline-api-1.0.0-RC2-SNAPSHOT.jar
[INFO] [install:install]
[INFO] Installing /x1/continuum/working-directory/291/core/cocoon-pipeline/cocoon-pipeline-api/target/cocoon-pipeline-api-1.0.0-RC2-SNAPSHOT.jar
to /home/continuum/.m2/repository/org/apache/cocoon/cocoon-pipeline-api/1.0.0-RC2-SNAPSHOT/cocoon-pipeline-api-1.0.0-RC2-SNAPSHOT.jar
[INFO] ----------------------------------------------------------------------------
[INFO] Building Cocoon Util
[INFO]    task-segment: [clean, install]
[INFO] ----------------------------------------------------------------------------
[INFO] [clean:clean]
[INFO] Deleting directory /x1/continuum/working-directory/291/core/cocoon-util/target
[INFO] Deleting directory /x1/continuum/working-directory/291/core/cocoon-util/target/classes
[INFO] Deleting directory /x1/continuum/working-directory/291/core/cocoon-util/target/test-classes
[INFO] Deleting directory /x1/continuum/working-directory/291/core/cocoon-util/target/site
[INFO] [enforcer:enforce-once {execution: enforce-maven}]
[INFO] [resources:resources]
[INFO] Using default encoding to copy filtered resources.
[INFO] [compiler:compile]
[INFO] Compiling 24 source files to /x1/continuum/working-directory/291/core/cocoon-util/target/classes
[INFO] [resources:testResources]
[INFO] Using default encoding to copy filtered resources.
[INFO] [compiler:testCompile]
[INFO] Compiling 5 source files to /x1/continuum/working-directory/291/core/cocoon-util/target/test-classes
[INFO] [surefire:test]
[INFO] Surefire report directory: /x1/continuum/working-directory/291/core/cocoon-util/target/surefire-reports

-------------------------------------------------------
 T E S T S
-------------------------------------------------------
Running org.apache.cocoon.util.test.DeprecationTestCase
Tests run: 8, Failures: 0, Errors: 0, Skipped: 0, Time elapsed: 0.257 sec
Running org.apache.cocoon.util.test.IOUtilsTestCase
Tests run: 2, Failures: 0, Errors: 0, Skipped: 0, Time elapsed: 0.22 sec
Running org.apache.cocoon.util.test.NetUtilsTestCase
Tests run: 8, Failures: 0, Errors: 0, Skipped: 0, Time elapsed: 0.069 sec
Running org.apache.cocoon.util.test.MIMEUtilsTestCase
Tests run: 1, Failures: 0, Errors: 0, Skipped: 0, Time elapsed: 0.065 sec
Running org.apache.cocoon.util.WildcardMatcherHelperTestCase
Tests run: 40, Failures: 0, Errors: 0, Skipped: 0, Time elapsed: 0.306 sec

Results :
Tests run: 59, Failures: 0, Errors: 0, Skipped: 0

[INFO] [jar:jar]
[INFO] Building jar: /x1/continuum/working-directory/291/core/cocoon-util/target/cocoon-util-1.0.0-RC2-SNAPSHOT.jar
[INFO] [install:install]
[INFO] Installing /x1/continuum/working-directory/291/core/cocoon-util/target/cocoon-util-1.0.0-RC2-SNAPSHOT.jar
to /home/continuum/.m2/repository/org/apache/cocoon/cocoon-util/1.0.0-RC2-SNAPSHOT/cocoon-util-1.0.0-RC2-SNAPSHOT.jar
[INFO] ----------------------------------------------------------------------------
[INFO] Building Cocoon XML API
[INFO]    task-segment: [clean, install]
[INFO] ----------------------------------------------------------------------------
[INFO] [clean:clean]
[INFO] Deleting directory /x1/continuum/working-directory/291/core/cocoon-xml/cocoon-xml-api/target
[INFO] Deleting directory /x1/continuum/working-directory/291/core/cocoon-xml/cocoon-xml-api/target/classes
[INFO] Deleting directory /x1/continuum/working-directory/291/core/cocoon-xml/cocoon-xml-api/target/test-classes
[INFO] Deleting directory /x1/continuum/working-directory/291/core/cocoon-xml/cocoon-xml-api/target/site
[INFO] [enforcer:enforce-once {execution: enforce-maven}]
[INFO] [resources:resources]
[INFO] Using default encoding to copy filtered resources.
[INFO] [compiler:compile]
[INFO] Compiling 2 source files to /x1/continuum/working-directory/291/core/cocoon-xml/cocoon-xml-api/target/classes
[INFO] [resources:testResources]
[INFO] Using default encoding to copy filtered resources.
[INFO] [compiler:testCompile]
[INFO] No sources to compile
[INFO] [surefire:test]
[INFO] No tests to run.
[INFO] [jar:jar]
[INFO] Building jar: /x1/continuum/working-directory/291/core/cocoon-xml/cocoon-xml-api/target/cocoon-xml-api-1.0.0-RC2-SNAPSHOT.jar
[INFO] [install:install]
[INFO] Installing /x1/continuum/working-directory/291/core/cocoon-xml/cocoon-xml-api/target/cocoon-xml-api-1.0.0-RC2-SNAPSHOT.jar
to /home/continuum/.m2/repository/org/apache/cocoon/cocoon-xml-api/1.0.0-RC2-SNAPSHOT/cocoon-xml-api-1.0.0-RC2-SNAPSHOT.jar
[INFO] ----------------------------------------------------------------------------
[INFO] Building Cocoon Pipeline Implementation
[INFO]    task-segment: [clean, install]
[INFO] ----------------------------------------------------------------------------
[INFO] [clean:clean]
[INFO] Deleting directory /x1/continuum/working-directory/291/core/cocoon-pipeline/cocoon-pipeline-impl/target
[INFO] Deleting directory /x1/continuum/working-directory/291/core/cocoon-pipeline/cocoon-pipeline-impl/target/classes
[INFO] Deleting directory /x1/continuum/working-directory/291/core/cocoon-pipeline/cocoon-pipeline-impl/target/test-classes
[INFO] Deleting directory /x1/continuum/working-directory/291/core/cocoon-pipeline/cocoon-pipeline-impl/target/site
[INFO] [enforcer:enforce-once {execution: enforce-maven}]
[INFO] [resources:resources]
[INFO] Using default encoding to copy filtered resources.
[INFO] [compiler:compile]
[INFO] Compiling 85 source files to /x1/continuum/working-directory/291/core/cocoon-pipeline/cocoon-pipeline-impl/target/classes
[INFO] [resources:testResources]
[INFO] Using default encoding to copy filtered resources.
[INFO] [compiler:testCompile]
[INFO] Compiling 9 source files to /x1/continuum/working-directory/291/core/cocoon-pipeline/cocoon-pipeline-impl/target/test-classes
[INFO] [surefire:test]
[INFO] Surefire report directory: /x1/continuum/working-directory/291/core/cocoon-pipeline/cocoon-pipeline-impl/target/surefire-reports

-------------------------------------------------------
 T E S T S
-------------------------------------------------------
Running org.apache.cocoon.xml.SaxBufferTestCase
consuming: 92592.0 documents per second
parsed:1864.0 documents per second
recalling: 294117.0 documents per second
Tests run: 3, Failures: 0, Errors: 0, Skipped: 0, Time elapsed: 5.951 sec
Running org.apache.cocoon.xml.dom.DOMBuilderTestCase
Tests run: 1, Failures: 0, Errors: 0, Skipped: 0, Time elapsed: 0.033 sec
Running org.apache.cocoon.components.sax.XMLByteStreamCompilerInterpreterTestCase
consuming: 121951.0 documents per second
parsed: 1868.0 documents per second
recalling: 138888.0 documents per second
Tests run: 4, Failures: 0, Errors: 0, Skipped: 0, Time elapsed: 5.758 sec
Running org.apache.cocoon.xml.dom.DOMBuilderStreamerTestCase
<?xml version="1.0" encoding="UTF-8"?><root/>
<?xml version="1.0" encoding="UTF-8"?><!--abcd--><root/>
Tests run: 7, Failures: 0, Errors: 0, Skipped: 0, Time elapsed: 0.168 sec
Running org.apache.cocoon.xml.NamespacesTableTestCase
Tests run: 6, Failures: 0, Errors: 0, Skipped: 0, Time elapsed: 0.032 sec

Results :
Tests run: 21, Failures: 0, Errors: 0, Skipped: 0

[INFO] [jar:jar]
[INFO] Building jar: /x1/continuum/working-directory/291/core/cocoon-pipeline/cocoon-pipeline-impl/target/cocoon-pipeline-impl-1.0.0-RC2-SNAPSHOT.jar
[INFO] [jar:test-jar {execution: default}]
[INFO] Building jar: /x1/continuum/working-directory/291/core/cocoon-pipeline/cocoon-pipeline-impl/target/cocoon-pipeline-impl-1.0.0-RC2-SNAPSHOT-tests.jar
[INFO] [install:install]
[INFO] Installing /x1/continuum/working-directory/291/core/cocoon-pipeline/cocoon-pipeline-impl/target/cocoon-pipeline-impl-1.0.0-RC2-SNAPSHOT.jar
to /home/continuum/.m2/repository/org/apache/cocoon/cocoon-pipeline-impl/1.0.0-RC2-SNAPSHOT/cocoon-pipeline-impl-1.0.0-RC2-SNAPSHOT.jar
[INFO] Installing /x1/continuum/working-directory/291/core/cocoon-pipeline/cocoon-pipeline-impl/target/cocoon-pipeline-impl-1.0.0-RC2-SNAPSHOT-tests.jar
to /home/continuum/.m2/repository/org/apache/cocoon/cocoon-pipeline-impl/1.0.0-RC2-SNAPSHOT/cocoon-pipeline-impl-1.0.0-RC2-SNAPSHOT-tests.jar
[INFO] ----------------------------------------------------------------------------
[INFO] Building Cocoon XML Implementation
[INFO]    task-segment: [clean, install]
[INFO] ----------------------------------------------------------------------------
[INFO] [clean:clean]
[INFO] Deleting directory /x1/continuum/working-directory/291/core/cocoon-xml/cocoon-xml-impl/target
[INFO] Deleting directory /x1/continuum/working-directory/291/core/cocoon-xml/cocoon-xml-impl/target/classes
[INFO] Deleting directory /x1/continuum/working-directory/291/core/cocoon-xml/cocoon-xml-impl/target/test-classes
[INFO] Deleting directory /x1/continuum/working-directory/291/core/cocoon-xml/cocoon-xml-impl/target/site
[INFO] [enforcer:enforce-once {execution: enforce-maven}]
[INFO] [resources:resources]
[INFO] Using default encoding to copy filtered resources.
[INFO] [compiler:compile]
[INFO] Compiling 4 source files to /x1/continuum/working-directory/291/core/cocoon-xml/cocoon-xml-impl/target/classes
[INFO] [resources:testResources]
[INFO] Using default encoding to copy filtered resources.
[INFO] [compiler:testCompile]
[INFO] No sources to compile
[INFO] [surefire:test]
[INFO] No tests to run.
[INFO] [jar:jar]
[INFO] Building jar: /x1/continuum/working-directory/291/core/cocoon-xml/cocoon-xml-impl/target/cocoon-xml-impl-1.0.0-RC2-SNAPSHOT.jar
[INFO] [install:install]
[INFO] Installing /x1/continuum/working-directory/291/core/cocoon-xml/cocoon-xml-impl/target/cocoon-xml-impl-1.0.0-RC2-SNAPSHOT.jar
to /home/continuum/.m2/repository/org/apache/cocoon/cocoon-xml-impl/1.0.0-RC2-SNAPSHOT/cocoon-xml-impl-1.0.0-RC2-SNAPSHOT.jar
[INFO] ----------------------------------------------------------------------------
[INFO] Building Cocoon Pipeline Components
[INFO]    task-segment: [clean, install]
[INFO] ----------------------------------------------------------------------------
[INFO] [clean:clean]
[INFO] Deleting directory /x1/continuum/working-directory/291/core/cocoon-pipeline/cocoon-pipeline-components/target
[INFO] Deleting directory /x1/continuum/working-directory/291/core/cocoon-pipeline/cocoon-pipeline-components/target/classes
[INFO] Deleting directory /x1/continuum/working-directory/291/core/cocoon-pipeline/cocoon-pipeline-components/target/test-classes
[INFO] Deleting directory /x1/continuum/working-directory/291/core/cocoon-pipeline/cocoon-pipeline-components/target/site
[INFO] [enforcer:enforce-once {execution: enforce-maven}]
[INFO] [resources:resources]
[INFO] Using default encoding to copy filtered resources.
[INFO] [compiler:compile]
[INFO] Compiling 69 source files to /x1/continuum/working-directory/291/core/cocoon-pipeline/cocoon-pipeline-components/target/classes
[INFO] [resources:testResources]
[INFO] Using default encoding to copy filtered resources.
[INFO] [compiler:testCompile]
[INFO] Nothing to compile - all classes are up to date
[INFO] [surefire:test]
[INFO] Surefire report directory: /x1/continuum/working-directory/291/core/cocoon-pipeline/cocoon-pipeline-components/target/surefire-reports

-------------------------------------------------------
 T E S T S
-------------------------------------------------------
There are no tests to run.

Results :
Tests run: 0, Failures: 0, Errors: 0, Skipped: 0

[INFO] [jar:jar]
[INFO] Building jar: /x1/continuum/working-directory/291/core/cocoon-pipeline/cocoon-pipeline-components/target/cocoon-pipeline-components-1.0.0-RC2-SNAPSHOT.jar
[INFO] [install:install]
[INFO] Installing /x1/continuum/working-directory/291/core/cocoon-pipeline/cocoon-pipeline-components/target/cocoon-pipeline-components-1.0.0-RC2-SNAPSHOT.jar
to /home/continuum/.m2/repository/org/apache/cocoon/cocoon-pipeline-components/1.0.0-RC2-SNAPSHOT/cocoon-pipeline-components-1.0.0-RC2-SNAPSHOT.jar
[INFO] ----------------------------------------------------------------------------
[INFO] Building Cocoon Sitemap API
[INFO]    task-segment: [clean, install]
[INFO] ----------------------------------------------------------------------------
[INFO] [clean:clean]
[INFO] Deleting directory /x1/continuum/working-directory/291/core/cocoon-sitemap/cocoon-sitemap-api/target
[INFO] Deleting directory /x1/continuum/working-directory/291/core/cocoon-sitemap/cocoon-sitemap-api/target/classes
[INFO] Deleting directory /x1/continuum/working-directory/291/core/cocoon-sitemap/cocoon-sitemap-api/target/test-classes
[INFO] Deleting directory /x1/continuum/working-directory/291/core/cocoon-sitemap/cocoon-sitemap-api/target/site
[INFO] [enforcer:enforce-once {execution: enforce-maven}]
[INFO] [resources:resources]
[INFO] Using default encoding to copy filtered resources.
[INFO] [compiler:compile]
[INFO] Compiling 29 source files to /x1/continuum/working-directory/291/core/cocoon-sitemap/cocoon-sitemap-api/target/classes
[INFO] [resources:testResources]
[INFO] Using default encoding to copy filtered resources.
[INFO] [compiler:testCompile]
[INFO] No sources to compile
[INFO] [surefire:test]
[INFO] No tests to run.
[INFO] [jar:jar]
[INFO] Building jar: /x1/continuum/working-directory/291/core/cocoon-sitemap/cocoon-sitemap-api/target/cocoon-sitemap-api-1.0.0-RC2-SNAPSHOT.jar
[INFO] [install:install]
[INFO] Installing /x1/continuum/working-directory/291/core/cocoon-sitemap/cocoon-sitemap-api/target/cocoon-sitemap-api-1.0.0-RC2-SNAPSHOT.jar
to /home/continuum/.m2/repository/org/apache/cocoon/cocoon-sitemap-api/1.0.0-RC2-SNAPSHOT/cocoon-sitemap-api-1.0.0-RC2-SNAPSHOT.jar
[INFO] ----------------------------------------------------------------------------
[INFO] Building Cocoon Thread API
[INFO]    task-segment: [clean, install]
[INFO] ----------------------------------------------------------------------------
[INFO] [clean:clean]
[INFO] Deleting directory /x1/continuum/working-directory/291/core/cocoon-thread/cocoon-thread-api/target
[INFO] Deleting directory /x1/continuum/working-directory/291/core/cocoon-thread/cocoon-thread-api/target/classes
[INFO] Deleting directory /x1/continuum/working-directory/291/core/cocoon-thread/cocoon-thread-api/target/test-classes
[INFO] Deleting directory /x1/continuum/working-directory/291/core/cocoon-thread/cocoon-thread-api/target/site
[INFO] [enforcer:enforce-once {execution: enforce-maven}]
[INFO] [resources:resources]
[INFO] Using default encoding to copy filtered resources.
[INFO] [compiler:compile]
[INFO] Compiling 4 source files to /x1/continuum/working-directory/291/core/cocoon-thread/cocoon-thread-api/target/classes
[INFO] [resources:testResources]
[INFO] Using default encoding to copy filtered resources.
[INFO] [compiler:testCompile]
[INFO] No sources to compile
[INFO] [surefire:test]
[INFO] No tests to run.
[INFO] [jar:jar]
[INFO] Building jar: /x1/continuum/working-directory/291/core/cocoon-thread/cocoon-thread-api/target/cocoon-thread-api-1.0.0-RC2-SNAPSHOT.jar
[INFO] [install:install]
[INFO] Installing /x1/continuum/working-directory/291/core/cocoon-thread/cocoon-thread-api/target/cocoon-thread-api-1.0.0-RC2-SNAPSHOT.jar
to /home/continuum/.m2/repository/org/apache/cocoon/cocoon-thread-api/1.0.0-RC2-SNAPSHOT/cocoon-thread-api-1.0.0-RC2-SNAPSHOT.jar
[INFO] ----------------------------------------------------------------------------
[INFO] Building Cocoon Sitemap Implementation
[INFO]    task-segment: [clean, install]
[INFO] ----------------------------------------------------------------------------
[INFO] [clean:clean]
[INFO] Deleting directory /x1/continuum/working-directory/291/core/cocoon-sitemap/cocoon-sitemap-impl/target
[INFO] Deleting directory /x1/continuum/working-directory/291/core/cocoon-sitemap/cocoon-sitemap-impl/target/classes
[INFO] Deleting directory /x1/continuum/working-directory/291/core/cocoon-sitemap/cocoon-sitemap-impl/target/test-classes
[INFO] Deleting directory /x1/continuum/working-directory/291/core/cocoon-sitemap/cocoon-sitemap-impl/target/site
[INFO] [enforcer:enforce-once {execution: enforce-maven}]
[INFO] [resources:resources]
[INFO] Using default encoding to copy filtered resources.
[INFO] [compiler:compile]
[INFO] Compiling 176 source files to /x1/continuum/working-directory/291/core/cocoon-sitemap/cocoon-sitemap-impl/target/classes
[INFO] [resources:testResources]
[INFO] Using default encoding to copy filtered resources.
[INFO] [compiler:testCompile]
[INFO] Nothing to compile - all classes are up to date
[INFO] [surefire:test]
[INFO] Surefire report directory: /x1/continuum/working-directory/291/core/cocoon-sitemap/cocoon-sitemap-impl/target/surefire-reports

-------------------------------------------------------
 T E S T S
-------------------------------------------------------
There are no tests to run.

Results :
Tests run: 0, Failures: 0, Errors: 0, Skipped: 0

[INFO] [jar:jar]
[INFO] Building jar: /x1/continuum/working-directory/291/core/cocoon-sitemap/cocoon-sitemap-impl/target/cocoon-sitemap-impl-1.0.0-RC2-SNAPSHOT.jar
[INFO] [install:install]
[INFO] Installing /x1/continuum/working-directory/291/core/cocoon-sitemap/cocoon-sitemap-impl/target/cocoon-sitemap-impl-1.0.0-RC2-SNAPSHOT.jar
to /home/continuum/.m2/repository/org/apache/cocoon/cocoon-sitemap-impl/1.0.0-RC2-SNAPSHOT/cocoon-sitemap-impl-1.0.0-RC2-SNAPSHOT.jar
[INFO] ----------------------------------------------------------------------------
[INFO] Building Cocoon Sitemap Components
[INFO]    task-segment: [clean, install]
[INFO] ----------------------------------------------------------------------------
[INFO] [clean:clean]
[INFO] Deleting directory /x1/continuum/working-directory/291/core/cocoon-sitemap/cocoon-sitemap-components/target
[INFO] Deleting directory /x1/continuum/working-directory/291/core/cocoon-sitemap/cocoon-sitemap-components/target/classes
[INFO] Deleting directory /x1/continuum/working-directory/291/core/cocoon-sitemap/cocoon-sitemap-components/target/test-classes
[INFO] Deleting directory /x1/continuum/working-directory/291/core/cocoon-sitemap/cocoon-sitemap-components/target/site
[INFO] [enforcer:enforce-once {execution: enforce-maven}]
[INFO] [resources:resources]
[INFO] Using default encoding to copy filtered resources.
[INFO] [compiler:compile]
[INFO] Compiling 106 source files to /x1/continuum/working-directory/291/core/cocoon-sitemap/cocoon-sitemap-components/target/classes
[INFO] [resources:testResources]
[INFO] Using default encoding to copy filtered resources.
[INFO] [compiler:testCompile]
[INFO] Nothing to compile - all classes are up to date
[INFO] [surefire:test]
[INFO] Surefire report directory: /x1/continuum/working-directory/291/core/cocoon-sitemap/cocoon-sitemap-components/target/surefire-reports

-------------------------------------------------------
 T E S T S
-------------------------------------------------------
There are no tests to run.

Results :
Tests run: 0, Failures: 0, Errors: 0, Skipped: 0

[INFO] [jar:jar]
[INFO] Building jar: /x1/continuum/working-directory/291/core/cocoon-sitemap/cocoon-sitemap-components/target/cocoon-sitemap-components-1.0.0-RC2-SNAPSHOT.jar
[INFO] [install:install]
[INFO] Installing /x1/continuum/working-directory/291/core/cocoon-sitemap/cocoon-sitemap-components/target/cocoon-sitemap-components-1.0.0-RC2-SNAPSHOT.jar
to /home/continuum/.m2/repository/org/apache/cocoon/cocoon-sitemap-components/1.0.0-RC2-SNAPSHOT/cocoon-sitemap-components-1.0.0-RC2-SNAPSHOT.jar
[INFO] ----------------------------------------------------------------------------
[INFO] Building Cocoon XML Resolver
[INFO]    task-segment: [clean, install]
[INFO] ----------------------------------------------------------------------------
[INFO] [clean:clean]
[INFO] Deleting directory /x1/continuum/working-directory/291/core/cocoon-xml/cocoon-xml-resolver/target
[INFO] Deleting directory /x1/continuum/working-directory/291/core/cocoon-xml/cocoon-xml-resolver/target/classes
[INFO] Deleting directory /x1/continuum/working-directory/291/core/cocoon-xml/cocoon-xml-resolver/target/test-classes
[INFO] Deleting directory /x1/continuum/working-directory/291/core/cocoon-xml/cocoon-xml-resolver/target/site
[INFO] [enforcer:enforce-once {execution: enforce-maven}]
[INFO] [resources:resources]
[INFO] Using default encoding to copy filtered resources.
[INFO] [compiler:compile]
[INFO] Compiling 1 source file to /x1/continuum/working-directory/291/core/cocoon-xml/cocoon-xml-resolver/target/classes
[INFO] [resources:testResources]
[INFO] Using default encoding to copy filtered resources.
[INFO] [compiler:testCompile]
[INFO] No sources to compile
[INFO] [surefire:test]
[INFO] No tests to run.
[INFO] [jar:jar]
[INFO] Building jar: /x1/continuum/working-directory/291/core/cocoon-xml/cocoon-xml-resolver/target/cocoon-xml-resolver-1.0.0-RC2-SNAPSHOT.jar
[INFO] [install:install]
[INFO] Installing /x1/continuum/working-directory/291/core/cocoon-xml/cocoon-xml-resolver/target/cocoon-xml-resolver-1.0.0-RC2-SNAPSHOT.jar
to /home/continuum/.m2/repository/org/apache/cocoon/cocoon-xml-resolver/1.0.0-RC2-SNAPSHOT/cocoon-xml-resolver-1.0.0-RC2-SNAPSHOT.jar
[INFO] ----------------------------------------------------------------------------
[INFO] Building Cocoon Store Implementation
[INFO]    task-segment: [clean, install]
[INFO] ----------------------------------------------------------------------------
[INFO] [clean:clean]
[INFO] Deleting directory /x1/continuum/working-directory/291/core/cocoon-store/cocoon-store-impl/target
[INFO] Deleting directory /x1/continuum/working-directory/291/core/cocoon-store/cocoon-store-impl/target/classes
[INFO] Deleting directory /x1/continuum/working-directory/291/core/cocoon-store/cocoon-store-impl/target/test-classes
[INFO] Deleting directory /x1/continuum/working-directory/291/core/cocoon-store/cocoon-store-impl/target/site
[INFO] [enforcer:enforce-once {execution: enforce-maven}]
[INFO] [resources:resources]
[INFO] Using default encoding to copy filtered resources.
[INFO] [compiler:compile]
[INFO] Compiling 7 source files to /x1/continuum/working-directory/291/core/cocoon-store/cocoon-store-impl/target/classes
[INFO] [resources:testResources]
[INFO] Using default encoding to copy filtered resources.
[INFO] [compiler:testCompile]
[INFO] No sources to compile
[INFO] [surefire:test]
[INFO] No tests to run.
[INFO] [jar:jar]
[INFO] Building jar: /x1/continuum/working-directory/291/core/cocoon-store/cocoon-store-impl/target/cocoon-store-impl-1.0.0-RC2-SNAPSHOT.jar
[INFO] [install:install]
[INFO] Installing /x1/continuum/working-directory/291/core/cocoon-store/cocoon-store-impl/target/cocoon-store-impl-1.0.0-RC2-SNAPSHOT.jar
to /home/continuum/.m2/repository/org/apache/cocoon/cocoon-store-impl/1.0.0-RC2-SNAPSHOT/cocoon-store-impl-1.0.0-RC2-SNAPSHOT.jar
[INFO] ----------------------------------------------------------------------------
[INFO] Building Cocoon Thread Implementation
[INFO]    task-segment: [clean, install]
[INFO] ----------------------------------------------------------------------------
[INFO] [clean:clean]
[INFO] Deleting directory /x1/continuum/working-directory/291/core/cocoon-thread/cocoon-thread-impl/target
[INFO] Deleting directory /x1/continuum/working-directory/291/core/cocoon-thread/cocoon-thread-impl/target/classes
[INFO] Deleting directory /x1/continuum/working-directory/291/core/cocoon-thread/cocoon-thread-impl/target/test-classes
[INFO] Deleting directory /x1/continuum/working-directory/291/core/cocoon-thread/cocoon-thread-impl/target/site
[INFO] [enforcer:enforce-once {execution: enforce-maven}]
[INFO] [resources:resources]
[INFO] Using default encoding to copy filtered resources.
[INFO] [compiler:compile]
[INFO] Compiling 7 source files to /x1/continuum/working-directory/291/core/cocoon-thread/cocoon-thread-impl/target/classes
[INFO] [resources:testResources]
[INFO] Using default encoding to copy filtered resources.
[INFO] [compiler:testCompile]
[INFO] Compiling 4 source files to /x1/continuum/working-directory/291/core/cocoon-thread/cocoon-thread-impl/target/test-classes
[INFO] [surefire:test]
[INFO] Surefire report directory: /x1/continuum/working-directory/291/core/cocoon-thread/cocoon-thread-impl/target/surefire-reports

-------------------------------------------------------
 T E S T S
-------------------------------------------------------
Running org.apache.cocoon.components.thread.DefaultThreadFactoryTestCase
Tests run: 5, Failures: 0, Errors: 0, Skipped: 0, Time elapsed: 0.316 sec
Running org.apache.cocoon.components.thread.DefaultThreadPoolTestCase
log4j:WARN No appenders could be found for logger (org.apache.cocoon.components.thread.DefaultThreadPool).
log4j:WARN Please initialize the log4j system properly.
Tests run: 3, Failures: 0, Errors: 0, Skipped: 0, Time elapsed: 1.389 sec
Running org.apache.cocoon.components.thread.DefaultRunnableManagerTestCase
Tests run: 11, Failures: 0, Errors: 0, Skipped: 0, Time elapsed: 0.089 sec

Results :
Tests run: 19, Failures: 0, Errors: 0, Skipped: 0

[INFO] [jar:jar]
[INFO] Building jar: /x1/continuum/working-directory/291/core/cocoon-thread/cocoon-thread-impl/target/cocoon-thread-impl-1.0.0-RC2-SNAPSHOT.jar
[INFO] [install:install]
[INFO] Installing /x1/continuum/working-directory/291/core/cocoon-thread/cocoon-thread-impl/target/cocoon-thread-impl-1.0.0-RC2-SNAPSHOT.jar
to /home/continuum/.m2/repository/org/apache/cocoon/cocoon-thread-impl/1.0.0-RC2-SNAPSHOT/cocoon-thread-impl-1.0.0-RC2-SNAPSHOT.jar
[INFO] ----------------------------------------------------------------------------
[INFO] Building Cocoon Core
[INFO]    task-segment: [clean, install]
[INFO] ----------------------------------------------------------------------------
[INFO] [clean:clean]
[INFO] Deleting directory /x1/continuum/working-directory/291/core/cocoon-core/target
[INFO] Deleting directory /x1/continuum/working-directory/291/core/cocoon-core/target/classes
[INFO] Deleting directory /x1/continuum/working-directory/291/core/cocoon-core/target/test-classes
[INFO] Deleting directory /x1/continuum/working-directory/291/core/cocoon-core/target/site
[INFO] [enforcer:enforce-once {execution: enforce-maven}]
[INFO] [resources:resources]
[INFO] Using default encoding to copy filtered resources.
[INFO] [compiler:compile]
[INFO] Compiling 85 source files to /x1/continuum/working-directory/291/core/cocoon-core/target/classes
[INFO] ------------------------------------------------------------------------
[ERROR] BUILD FAILURE
[INFO] ------------------------------------------------------------------------
[INFO] Compilation failure
/x1/continuum/working-directory/291/core/cocoon-core/src/main/java/org/apache/cocoon/servlet/SitemapServlet.java:[34,7]
class SitemapServletttttt is public, should be declared in a file named SitemapServletttttt.java



/x1/continuum/working-directory/291/core/cocoon-core/src/main/java/org/apache/cocoon/servlet/SitemapServlet.java:[34,7]
class SitemapServletttttt is public, should be declared in a file named SitemapServletttttt.java


[INFO] ------------------------------------------------------------------------
[INFO] For more information, run Maven with the -e switch
[INFO] ------------------------------------------------------------------------
[INFO] Total time: 3 minutes 35 seconds
[INFO] Finished at: Tue Jul 03 02:32:40 PDT 2007
[INFO] Final Memory: 32M/63M
[INFO] ------------------------------------------------------------------------

****************************************************************************



Mime
View raw message