cocoon-dev mailing list archives

Site index · List index
Message view « Date » · « Thread »
Top « Date » · « Thread »
From "Continuum@vmbuild.apache.org" <...@cocoon.apache.org>
Subject [continuum] BUILD FAILURE: Apache Cocoon
Date Wed, 16 May 2007 10:47:19 GMT
Online report : http://vmbuild.apache.org/continuum/servlet/continuum/target/ProjectBuild.vm/view/ProjectBuild/id/291/buildId/148600
Build statistics:
  State: Failed
  Previous State: Ok
  Started at: Wed, 16 May 2007 03:47:06 -0700
  Finished at: Wed, 16 May 2007 03:47:19 -0700
  Total time: 12s
  Build Trigger: Schedule
  Exit code: 1
  Building machine hostname: vmbuild.apache.org
  Operating system : Linux(unknown)
  Java version : 1.5.0_06(Sun Microsystems Inc.)

Changes
         felixk          - move to servlet-service
- add blockServlet bean
             /cocoon/trunk/blocks/cocoon-jcr/cocoon-jcr-sample/pom.xml
            /cocoon/trunk/blocks/cocoon-jcr/cocoon-jcr-sample/src/main/resources/COB-INF/jcr.xsamples
            /cocoon/trunk/blocks/cocoon-jcr/cocoon-jcr-sample/src/main/resources/COB-INF/sitemap.xmap
            /cocoon/trunk/blocks/cocoon-jcr/cocoon-jcr-sample/src/main/resources/META-INF
            /cocoon/trunk/blocks/cocoon-jcr/cocoon-jcr-sample/src/main/resources/META-INF/cocoon
            /cocoon/trunk/blocks/cocoon-jcr/cocoon-jcr-sample/src/main/resources/META-INF/cocoon/spring
            /cocoon/trunk/blocks/cocoon-jcr/cocoon-jcr-sample/src/main/resources/META-INF/cocoon/spring/cocoon-jcr-sample-blockServlet.xml
           felixk          - move to servlet-service
- add blockServlet bean
             /cocoon/trunk/blocks/cocoon-jfor/cocoon-jfor-sample/pom.xml
            /cocoon/trunk/blocks/cocoon-jfor/cocoon-jfor-sample/src/main/resources/COB-INF/jfor.xsamples
            /cocoon/trunk/blocks/cocoon-jfor/cocoon-jfor-sample/src/main/resources/COB-INF/sitemap.xmap
            /cocoon/trunk/blocks/cocoon-jfor/cocoon-jfor-sample/src/main/resources/META-INF
            /cocoon/trunk/blocks/cocoon-jfor/cocoon-jfor-sample/src/main/resources/META-INF/cocoon
            /cocoon/trunk/blocks/cocoon-jfor/cocoon-jfor-sample/src/main/resources/META-INF/cocoon/spring
            /cocoon/trunk/blocks/cocoon-jfor/cocoon-jfor-sample/src/main/resources/META-INF/cocoon/spring/cocoon-jfor-sample-blockServlet.xml
           felixk          - move to servlet-service
- add blockServlet bean
             /cocoon/trunk/blocks/cocoon-jsp/cocoon-jsp-sample/pom.xml
            /cocoon/trunk/blocks/cocoon-jsp/cocoon-jsp-sample/src/main/resources/COB-INF/jsp.xsamples
            /cocoon/trunk/blocks/cocoon-jsp/cocoon-jsp-sample/src/main/resources/COB-INF/sitemap.xmap
            /cocoon/trunk/blocks/cocoon-jsp/cocoon-jsp-sample/src/main/resources/META-INF
            /cocoon/trunk/blocks/cocoon-jsp/cocoon-jsp-sample/src/main/resources/META-INF/cocoon
            /cocoon/trunk/blocks/cocoon-jsp/cocoon-jsp-sample/src/main/resources/META-INF/cocoon/spring
            /cocoon/trunk/blocks/cocoon-jsp/cocoon-jsp-sample/src/main/resources/META-INF/cocoon/spring/cocoon-jsp-sample-blockServlet.xml
           reinhard          [maven-release-plugin] prepare release cocoon-4
             /cocoon/trunk/pom.xml
           reinhard          [maven-release-plugin] prepare for next development iteration
             /cocoon/trunk/pom.xml
           felixk          - move to servlet-service
- add blockServlet bean
             /cocoon/trunk/blocks/cocoon-lucene/cocoon-lucene-sample/pom.xml
            /cocoon/trunk/blocks/cocoon-lucene/cocoon-lucene-sample/src/main/resources/COB-INF/lucene.xsamples
            /cocoon/trunk/blocks/cocoon-lucene/cocoon-lucene-sample/src/main/resources/COB-INF/sitemap.xmap
            /cocoon/trunk/blocks/cocoon-lucene/cocoon-lucene-sample/src/main/resources/COB-INF/stylesheets/lucene-index2html.xsl
            /cocoon/trunk/blocks/cocoon-lucene/cocoon-lucene-sample/src/main/resources/COB-INF/stylesheets/search-index2html.xsl
            /cocoon/trunk/blocks/cocoon-lucene/cocoon-lucene-sample/src/main/resources/COB-INF/stylesheets/search2html.xsl
            /cocoon/trunk/blocks/cocoon-lucene/cocoon-lucene-sample/src/main/resources/META-INF
            /cocoon/trunk/blocks/cocoon-lucene/cocoon-lucene-sample/src/main/resources/META-INF/cocoon
            /cocoon/trunk/blocks/cocoon-lucene/cocoon-lucene-sample/src/main/resources/META-INF/cocoon/spring
            /cocoon/trunk/blocks/cocoon-lucene/cocoon-lucene-sample/src/main/resources/META-INF/cocoon/spring/cocoon-lucene-sample-blockServlet.xml
           reinhard          I will increase the version number later so that the build of
all trunk users isn't affected
             /cocoon/trunk/pom.xml
           reinhard          [maven-release-plugin] prepare release cocoon-core-modules-4
             /cocoon/trunk/core/pom.xml
           reinhard          [maven-release-plugin] prepare for next development iteration
             /cocoon/trunk/core/pom.xml
        
****************************************************************************
Output:
****************************************************************************
[INFO] Scanning for projects...
Downloading: http://repo1.maven.org/maven2/org/apache/cocoon/cocoon/4/cocoon-4.pom
[INFO] ------------------------------------------------------------------------
[ERROR] FATAL ERROR
[INFO] ------------------------------------------------------------------------
[INFO] Failed to resolve artifact.

GroupId: org.apache.cocoon
ArtifactId: cocoon
Version: 4

Reason: Unable to download the artifact from any repository

  org.apache.cocoon:cocoon:pom:4

from the specified remote repositories:
  central (http://repo1.maven.org/maven2)


[INFO] ------------------------------------------------------------------------
[INFO] Trace
org.apache.maven.reactor.MavenExecutionException: Cannot find parent: org.apache.cocoon:cocoon
for project: null:cocoon-core-modules:pom:4-SNAPSHOT
	at org.apache.maven.DefaultMaven.getProjects(DefaultMaven.java:378)
	at org.apache.maven.DefaultMaven.doExecute(DefaultMaven.java:290)
	at org.apache.maven.DefaultMaven.execute(DefaultMaven.java:125)
	at org.apache.maven.cli.MavenCli.main(MavenCli.java:272)
	at sun.reflect.NativeMethodAccessorImpl.invoke0(Native Method)
	at sun.reflect.NativeMethodAccessorImpl.invoke(NativeMethodAccessorImpl.java:39)
	at sun.reflect.DelegatingMethodAccessorImpl.invoke(DelegatingMethodAccessorImpl.java:25)
	at java.lang.reflect.Method.invoke(Method.java:585)
	at org.codehaus.classworlds.Launcher.launchEnhanced(Launcher.java:315)
	at org.codehaus.classworlds.Launcher.launch(Launcher.java:255)
	at org.codehaus.classworlds.Launcher.mainWithExitCode(Launcher.java:430)
	at org.codehaus.classworlds.Launcher.main(Launcher.java:375)
Caused by: org.apache.maven.project.ProjectBuildingException: Cannot find parent: org.apache.cocoon:cocoon
for project: null:cocoon-core-modules:pom:4-SNAPSHOT
	at org.apache.maven.project.DefaultMavenProjectBuilder.assembleLineage(DefaultMavenProjectBuilder.java:1264)
	at org.apache.maven.project.DefaultMavenProjectBuilder.buildInternal(DefaultMavenProjectBuilder.java:749)
	at org.apache.maven.project.DefaultMavenProjectBuilder.buildFromSourceFileInternal(DefaultMavenProjectBuilder.java:479)
	at org.apache.maven.project.DefaultMavenProjectBuilder.build(DefaultMavenProjectBuilder.java:200)
	at org.apache.maven.DefaultMaven.getProject(DefaultMaven.java:537)
	at org.apache.maven.DefaultMaven.collectProjects(DefaultMaven.java:467)
	at org.apache.maven.DefaultMaven.collectProjects(DefaultMaven.java:511)
	at org.apache.maven.DefaultMaven.getProjects(DefaultMaven.java:364)
	... 11 more
Caused by: org.apache.maven.project.ProjectBuildingException: POM 'org.apache.cocoon:cocoon'
not found in repository: Unable to download the artifact from any repository

  org.apache.cocoon:cocoon:pom:4

from the specified remote repositories:
  central (http://repo1.maven.org/maven2)

	at org.apache.maven.project.DefaultMavenProjectBuilder.findModelFromRepository(DefaultMavenProjectBuilder.java:573)
	at org.apache.maven.project.DefaultMavenProjectBuilder.assembleLineage(DefaultMavenProjectBuilder.java:1260)
	... 18 more
Caused by: org.apache.maven.artifact.resolver.ArtifactNotFoundException: Unable to download
the artifact from any repository

  org.apache.cocoon:cocoon:pom:4

from the specified remote repositories:
  central (http://repo1.maven.org/maven2)

	at org.apache.maven.artifact.resolver.DefaultArtifactResolver.resolve(DefaultArtifactResolver.java:197)
	at org.apache.maven.artifact.resolver.DefaultArtifactResolver.resolve(DefaultArtifactResolver.java:73)
	at org.apache.maven.project.DefaultMavenProjectBuilder.findModelFromRepository(DefaultMavenProjectBuilder.java:526)
	... 19 more
Caused by: org.apache.maven.wagon.ResourceDoesNotExistException: Unable to download the artifact
from any repository
	at org.apache.maven.artifact.manager.DefaultWagonManager.getArtifact(DefaultWagonManager.java:324)
	at org.apache.maven.artifact.resolver.DefaultArtifactResolver.resolve(DefaultArtifactResolver.java:185)
	... 21 more
[INFO] ------------------------------------------------------------------------
[INFO] Total time: 9 seconds
[INFO] Finished at: Wed May 16 03:47:18 PDT 2007
[INFO] Final Memory: 7M/13M
[INFO] ------------------------------------------------------------------------

****************************************************************************



Mime
View raw message