cocoon-dev mailing list archives

Site index · List index
Message view « Date » · « Thread »
Top « Date » · « Thread »
From "Continuum@vmbuild.apache.org" <...@cocoon.apache.org>
Subject [continuum] BUILD FAILURE: Apache Cocoon
Date Sun, 20 May 2007 20:03:34 GMT
Online report : http://vmbuild.apache.org/continuum/servlet/continuum/target/ProjectBuild.vm/view/ProjectBuild/id/291/buildId/154148
Build statistics:
  State: Failed
  Previous State: Failed
  Started at: Sun, 20 May 2007 13:03:22 -0700
  Finished at: Sun, 20 May 2007 13:03:34 -0700
  Total time: 11s
  Build Trigger: Schedule
  Exit code: 1
  Building machine hostname: vmbuild.apache.org
  Operating system : Linux(unknown)
  Java version : 1.5.0_06(Sun Microsystems Inc.)

Changes
         felixk          Add samples to dependencyManagement
             /cocoon/trunk/pom.xml
           felixk          Add samples to -Pallblocks
             /cocoon/trunk/core/cocoon-webapp/pom.xml
        
****************************************************************************
Output:
****************************************************************************
[INFO] Scanning for projects...
Downloading: http://repo1.maven.org/maven2/org/apache/cocoon/cocoon-blocks-modules/4/cocoon-blocks-modules-4.pom
[INFO] ------------------------------------------------------------------------
[ERROR] FATAL ERROR
[INFO] ------------------------------------------------------------------------
[INFO] Failed to resolve artifact.

GroupId: org.apache.cocoon
ArtifactId: cocoon-blocks-modules
Version: 4

Reason: Unable to download the artifact from any repository

  org.apache.cocoon:cocoon-blocks-modules:pom:4

from the specified remote repositories:
  central (http://repo1.maven.org/maven2)


[INFO] ------------------------------------------------------------------------
[INFO] Trace
org.apache.maven.reactor.MavenExecutionException: Cannot find parent: org.apache.cocoon:cocoon-blocks-modules
for project: null:cocoon-linkrewriter-impl:jar:1.0.0-RC2-SNAPSHOT
	at org.apache.maven.DefaultMaven.getProjects(DefaultMaven.java:378)
	at org.apache.maven.DefaultMaven.doExecute(DefaultMaven.java:290)
	at org.apache.maven.DefaultMaven.execute(DefaultMaven.java:125)
	at org.apache.maven.cli.MavenCli.main(MavenCli.java:272)
	at sun.reflect.NativeMethodAccessorImpl.invoke0(Native Method)
	at sun.reflect.NativeMethodAccessorImpl.invoke(NativeMethodAccessorImpl.java:39)
	at sun.reflect.DelegatingMethodAccessorImpl.invoke(DelegatingMethodAccessorImpl.java:25)
	at java.lang.reflect.Method.invoke(Method.java:585)
	at org.codehaus.classworlds.Launcher.launchEnhanced(Launcher.java:315)
	at org.codehaus.classworlds.Launcher.launch(Launcher.java:255)
	at org.codehaus.classworlds.Launcher.mainWithExitCode(Launcher.java:430)
	at org.codehaus.classworlds.Launcher.main(Launcher.java:375)
Caused by: org.apache.maven.project.ProjectBuildingException: Cannot find parent: org.apache.cocoon:cocoon-blocks-modules
for project: null:cocoon-linkrewriter-impl:jar:1.0.0-RC2-SNAPSHOT
	at org.apache.maven.project.DefaultMavenProjectBuilder.assembleLineage(DefaultMavenProjectBuilder.java:1264)
	at org.apache.maven.project.DefaultMavenProjectBuilder.buildInternal(DefaultMavenProjectBuilder.java:749)
	at org.apache.maven.project.DefaultMavenProjectBuilder.buildFromSourceFileInternal(DefaultMavenProjectBuilder.java:479)
	at org.apache.maven.project.DefaultMavenProjectBuilder.build(DefaultMavenProjectBuilder.java:200)
	at org.apache.maven.DefaultMaven.getProject(DefaultMaven.java:537)
	at org.apache.maven.DefaultMaven.collectProjects(DefaultMaven.java:467)
	at org.apache.maven.DefaultMaven.collectProjects(DefaultMaven.java:511)
	at org.apache.maven.DefaultMaven.collectProjects(DefaultMaven.java:511)
	at org.apache.maven.DefaultMaven.getProjects(DefaultMaven.java:364)
	... 11 more
Caused by: org.apache.maven.project.ProjectBuildingException: POM 'org.apache.cocoon:cocoon-blocks-modules'
not found in repository: Unable to download the artifact from any repository

  org.apache.cocoon:cocoon-blocks-modules:pom:4

from the specified remote repositories:
  central (http://repo1.maven.org/maven2)

	at org.apache.maven.project.DefaultMavenProjectBuilder.findModelFromRepository(DefaultMavenProjectBuilder.java:573)
	at org.apache.maven.project.DefaultMavenProjectBuilder.assembleLineage(DefaultMavenProjectBuilder.java:1260)
	... 19 more
Caused by: org.apache.maven.artifact.resolver.ArtifactNotFoundException: Unable to download
the artifact from any repository

  org.apache.cocoon:cocoon-blocks-modules:pom:4

from the specified remote repositories:
  central (http://repo1.maven.org/maven2)

	at org.apache.maven.artifact.resolver.DefaultArtifactResolver.resolve(DefaultArtifactResolver.java:197)
	at org.apache.maven.artifact.resolver.DefaultArtifactResolver.resolve(DefaultArtifactResolver.java:73)
	at org.apache.maven.project.DefaultMavenProjectBuilder.findModelFromRepository(DefaultMavenProjectBuilder.java:526)
	... 20 more
Caused by: org.apache.maven.wagon.ResourceDoesNotExistException: Unable to download the artifact
from any repository
	at org.apache.maven.artifact.manager.DefaultWagonManager.getArtifact(DefaultWagonManager.java:324)
	at org.apache.maven.artifact.resolver.DefaultArtifactResolver.resolve(DefaultArtifactResolver.java:185)
	... 22 more
[INFO] ------------------------------------------------------------------------
[INFO] Total time: 9 seconds
[INFO] Finished at: Sun May 20 13:03:33 PDT 2007
[INFO] Final Memory: 5M/10M
[INFO] ------------------------------------------------------------------------

****************************************************************************



Mime
View raw message