cocoon-dev mailing list archives

Site index · List index
Message view « Date » · « Thread »
Top « Date » · « Thread »
From "Continuum@vmbuild.apache.org" <...@cocoon.apache.org>
Subject [continuum] BUILD FAILURE: Cocoon Reloading Classloader - Maven 2 Plugin
Date Wed, 28 Feb 2007 00:25:16 GMT
Online report : http://vmbuild.apache.org/continuum/servlet/continuum/target/ProjectBuild.vm/view/ProjectBuild/id/332/buildId/65107
Build statistics:
  State: Failed
  Previous Build: No previous build.
  Started at: Tue, 27 Feb 2007 16:24:48 -0800
  Finished at: Tue, 27 Feb 2007 16:25:16 -0800
  Total time: 27s
  Build Trigger: Schedule
  Exit code: 1
  Building machine hostname: vmbuild.apache.org
  Operating system : Linux(unknown)
  Java version : 1.5.0_06(Sun Microsystems Inc.)

Changes
      No files changed
  
****************************************************************************
Output:
****************************************************************************
[INFO] Scanning for projects...
[INFO] ----------------------------------------------------------------------------
[INFO] Building Cocoon Reloading Classloader - Maven 2 Plugin
[INFO]    task-segment: [clean, install]
[INFO] ----------------------------------------------------------------------------
[INFO] [clean:clean]
[INFO] Deleting directory /x1/continuum/working-directory/332/target
[INFO] Deleting directory /x1/continuum/working-directory/332/target/classes
[INFO] Deleting directory /x1/continuum/working-directory/332/target/test-classes
[INFO] Deleting directory /x1/continuum/working-directory/332/target/site
[INFO] [plugin:descriptor]
[WARNING] Goal prefix is: cocoon-rcl; Maven currently expects it to be cocoon-rcl
[INFO] Using 2 extractors.
[INFO] Applying extractor for language: java
[INFO] Extractor for language: java found 1 mojo descriptors.
[INFO] Applying extractor for language: bsh
[INFO] Extractor for language: bsh found 0 mojo descriptors.
[INFO] [resources:resources]
[INFO] Using default encoding to copy filtered resources.
[WARNING] 
	Artifact junit:junit:jar:3.8.2:test retains local scope 'test' overriding broader scope 'compile'
	given by a dependency. If this is not intended, modify or remove the local scope.

Downloading: http://repo1.maven.org/maven2/commons-configuration/commons-configuration/1.3/commons-configuration-1.3.pom
11K downloaded
Downloading: http://repo1.maven.org/maven2/jdom/jdom/b9/jdom-b9.pom
139b downloaded
Downloading: http://repo1.maven.org/maven2/servletapi/servletapi/2.2/servletapi-2.2.pom
740b downloaded
Downloading: http://repo1.maven.org/maven2/javax/servlet/servlet-api/2.2/servlet-api-2.2.pom
156b downloaded
Downloading: http://repo1.maven.org/maven2/xerces/xerces/1.2.3/xerces-1.2.3.pom
146b downloaded
Downloading: http://repo1.maven.org/maven2/commons-beanutils/commons-beanutils/1.4/commons-beanutils-1.4.pom
1K downloaded
Downloading: http://repo1.maven.org/maven2/ant/ant-optional/1.5.1/ant-optional-1.5.1.pom
149b downloaded
Downloading: http://repo1.maven.org/maven2/commons-logging/commons-logging/1.0/commons-logging-1.0.jar
21K downloaded
Downloading: http://repo1.maven.org/maven2/xerces/xerces/1.2.3/xerces-1.2.3.jar
1464K downloaded
Downloading: http://repo1.maven.org/maven2/javax/servlet/servlet-api/2.2/servlet-api-2.2.jar
39K downloaded
Downloading: http://repo1.maven.org/maven2/commons-beanutils/commons-beanutils/1.4/commons-beanutils-1.4.jar
79K downloaded
Downloading: http://repo1.maven.org/maven2/commons-configuration/commons-configuration/1.3/commons-configuration-1.3.jar
227K downloaded
Downloading: http://repo1.maven.org/maven2/xerces/xercesImpl/2.2.1/xercesImpl-2.2.1.jar
815K downloaded
Downloading: http://repo1.maven.org/maven2/jdom/jdom/b9/jdom-b9.jar
132K downloaded
Downloading: http://repo1.maven.org/maven2/ant/ant-optional/1.5.1/ant-optional-1.5.1.jar
639K downloaded
[INFO] [compiler:compile]
Compiling 2 source files to /x1/continuum/working-directory/332/target/classes
[INFO] [resources:testResources]
[INFO] Using default encoding to copy filtered resources.
[INFO] [compiler:testCompile]
Compiling 1 source file to /x1/continuum/working-directory/332/target/test-classes
[INFO] [surefire:test]
[INFO] Surefire report directory: /x1/continuum/working-directory/332/target/surefire-reports

-------------------------------------------------------
 T E S T S
-------------------------------------------------------
Running org.apache.cocoon.maven.rcl.RwmPropertiesTest
Tests run: 2, Failures: 2, Errors: 0, Skipped: 0, Time elapsed: 0.499 sec <<< FAILURE!

Results :
Tests run: 2, Failures: 2, Errors: 0, Skipped: 0

[INFO] ------------------------------------------------------------------------
[ERROR] BUILD FAILURE
[INFO] ------------------------------------------------------------------------
[INFO] There are test failures.
[INFO] ------------------------------------------------------------------------
[INFO] For more information, run Maven with the -e switch
[INFO] ------------------------------------------------------------------------
[INFO] Total time: 24 seconds
[INFO] Finished at: Tue Feb 27 16:25:16 PST 2007
[INFO] Final Memory: 10M/23M
[INFO] ------------------------------------------------------------------------

****************************************************************************



Mime
View raw message