cocoon-dev mailing list archives

Site index · List index
Message view « Date » · « Thread »
Top « Date » · « Thread »
From "Continuum@vmbuild.apache.org" <...@cocoon.apache.org>
Subject [continuum] BUILD FAILURE: Cocoon Webapp
Date Wed, 28 Feb 2007 00:26:08 GMT
Online report : http://vmbuild.apache.org/continuum/servlet/continuum/target/ProjectBuild.vm/view/ProjectBuild/id/321/buildId/65112
Build statistics:
  State: Failed
  Previous Build: No previous build.
  Started at: Tue, 27 Feb 2007 16:25:51 -0800
  Finished at: Tue, 27 Feb 2007 16:26:08 -0800
  Total time: 16s
  Build Trigger: Schedule
  Exit code: 1
  Building machine hostname: vmbuild.apache.org
  Operating system : Linux(unknown)
  Java version : 1.5.0_06(Sun Microsystems Inc.)

Changes
      No files changed
  
****************************************************************************
Output:
****************************************************************************
[INFO] Scanning for projects...
[INFO] ----------------------------------------------------------------------------
[INFO] Building Cocoon Webapp
[INFO]    task-segment: [clean, install]
[INFO] ----------------------------------------------------------------------------
Downloading: http://snapshots.maven.codehaus.org/maven2/org/mortbay/jetty/maven-jetty-plugin/6.0.2/maven-jetty-plugin-6.0.2.pom
[WARNING] Unable to get resource from repository snapshots (http://snapshots.maven.codehaus.org/maven2)
Downloading: http://repo1.maven.org/maven2/org/mortbay/jetty/maven-jetty-plugin/6.0.2/maven-jetty-plugin-6.0.2.pom
4K downloaded
Downloading: http://snapshots.maven.codehaus.org/maven2/org/mortbay/jetty/project/6.0.2/project-6.0.2.pom
[WARNING] Unable to get resource from repository snapshots (http://snapshots.maven.codehaus.org/maven2)
Downloading: http://repo1.maven.org/maven2/org/mortbay/jetty/project/6.0.2/project-6.0.2.pom
11K downloaded
Downloading: http://snapshots.maven.codehaus.org/maven2/org/mortbay/jetty/maven-jetty-plugin/6.0.2/maven-jetty-plugin-6.0.2.jar
[WARNING] Unable to get resource from repository snapshots (http://snapshots.maven.codehaus.org/maven2)
Downloading: http://repo1.maven.org/maven2/org/mortbay/jetty/maven-jetty-plugin/6.0.2/maven-jetty-plugin-6.0.2.jar
39K downloaded
[INFO] [clean:clean]
[INFO] Deleting directory /x1/continuum/working-directory/321/target
[INFO] Deleting directory /x1/continuum/working-directory/321/target/classes
[INFO] Deleting directory /x1/continuum/working-directory/321/target/test-classes
[INFO] Deleting directory /x1/continuum/working-directory/321/target/site
[INFO] artifact org.apache.maven.plugins:maven-resources-plugin: checking for updates from
snapshots
[INFO] artifact org.apache.maven.plugins:maven-install-plugin: checking for updates from snapshots
[INFO] [resources:resources]
[INFO] Using default encoding to copy filtered resources.
[INFO] snapshot org.apache.cocoon:cocoon-servlet-service-components:1.0.0-RC1-SNAPSHOT: checking
for updates from apache.snapshots
Downloading: http://people.apache.org/repo/m2-snapshot-repository/org/apache/cocoon/cocoon-servlet-service-components/1.0.0-RC1-SNAPSHOT/cocoon-servlet-service-components-1.0.0-RC1-SNAPSHOT.pom
[WARNING] Unable to get resource from repository apache.snapshots (http://people.apache.org/repo/m2-snapshot-repository)
[INFO] snapshot org.apache.cocoon:cocoon-servlet-service-sample:1.0.0-SNAPSHOT: checking for
updates from apache.snapshots
Downloading: http://people.apache.org/repo/m2-snapshot-repository/org/apache/cocoon/cocoon-servlet-service-sample/1.0.0-SNAPSHOT/cocoon-servlet-service-sample-1.0.0-SNAPSHOT.pom
[WARNING] Unable to get resource from repository apache.snapshots (http://people.apache.org/repo/m2-snapshot-repository)
[INFO] snapshot org.apache.cocoon:cocoon-core-main-sample:1.0.0-SNAPSHOT: checking for updates
from apache.snapshots
Downloading: http://people.apache.org/repo/m2-snapshot-repository/org/apache/cocoon/cocoon-core-main-sample/1.0.0-SNAPSHOT/cocoon-core-main-sample-1.0.0-SNAPSHOT.pom
[WARNING] Unable to get resource from repository apache.snapshots (http://people.apache.org/repo/m2-snapshot-repository)
[INFO] snapshot org.apache.cocoon:cocoon-template-sample:1.0.0-SNAPSHOT: checking for updates
from apache.snapshots
Downloading: http://people.apache.org/repo/m2-snapshot-repository/org/apache/cocoon/cocoon-template-sample/1.0.0-SNAPSHOT/cocoon-template-sample-1.0.0-SNAPSHOT.pom
[WARNING] Unable to get resource from repository apache.snapshots (http://people.apache.org/repo/m2-snapshot-repository)
Downloading: http://people.apache.org/repo/m2-snapshot-repository/org/apache/cocoon/cocoon-core/2.2.0-RC1-SNAPSHOT/cocoon-core-2.2.0-RC1-SNAPSHOT.pom
[WARNING] Unable to get resource from repository apache.snapshots (http://people.apache.org/repo/m2-snapshot-repository)
[INFO] snapshot org.apache.cocoon:cocoon-ajax-sample:1.0.0-SNAPSHOT: checking for updates
from apache.snapshots
Downloading: http://people.apache.org/repo/m2-snapshot-repository/org/apache/cocoon/cocoon-ajax-sample/1.0.0-SNAPSHOT/cocoon-ajax-sample-1.0.0-20060728.032537-5.pom
639b downloaded
[INFO] snapshot org.apache.cocoon:cocoon-ajax:1-SNAPSHOT: checking for updates from apache.snapshots
Downloading: http://people.apache.org/repo/m2-snapshot-repository/org/apache/cocoon/cocoon-ajax/1-SNAPSHOT/cocoon-ajax-1-20060728.031822-10.pom
1K downloaded
[INFO] snapshot org.apache.cocoon:cocoon-blocks-modules:1-SNAPSHOT: checking for updates from
apache.snapshots
Downloading: http://people.apache.org/repo/m2-snapshot-repository/org/apache/cocoon/cocoon-blocks-modules/1-SNAPSHOT/cocoon-blocks-modules-1-20060729.031232-56.pom
3K downloaded
[INFO] snapshot org.apache.cocoon:cocoon:1-SNAPSHOT: checking for updates from apache.snapshots
Downloading: http://people.apache.org/repo/m2-snapshot-repository/org/apache/cocoon/cocoon/1-SNAPSHOT/cocoon-1-20060729.030245-70.pom
12K downloaded
[INFO] snapshot org.apache.cocoon:cocoon-core:2.2.0-SNAPSHOT: checking for updates from apache.snapshots
Downloading: http://people.apache.org/repo/m2-snapshot-repository/org/apache/cocoon/cocoon-core/2.2.0-SNAPSHOT/cocoon-core-2.2.0-20060731.033338-44.pom
10K downloaded
[INFO] snapshot org.apache.cocoon:cocoon-core-modules:1-SNAPSHOT: checking for updates from
apache.snapshots
Downloading: http://people.apache.org/repo/m2-snapshot-repository/org/apache/cocoon/cocoon-core-modules/1-SNAPSHOT/cocoon-core-modules-1-20060731.032957-54.pom
1K downloaded
[INFO] snapshot org.apache.cocoon:cocoon-forms-sample:1.0.0-SNAPSHOT: checking for updates
from apache.snapshots
Downloading: http://people.apache.org/repo/m2-snapshot-repository/org/apache/cocoon/cocoon-forms-sample/1.0.0-SNAPSHOT/cocoon-forms-sample-1.0.0-20060728.035423-7.pom
819b downloaded
[INFO] snapshot org.apache.cocoon:cocoon-forms:1-SNAPSHOT: checking for updates from apache.snapshots
Downloading: http://people.apache.org/repo/m2-snapshot-repository/org/apache/cocoon/cocoon-forms/1-SNAPSHOT/cocoon-forms-1-20060729.031633-28.pom
1K downloaded
[INFO] snapshot org.apache.cocoon:cocoon-template-impl:1.0.0-SNAPSHOT: checking for updates
from apache.snapshots
Downloading: http://people.apache.org/repo/m2-snapshot-repository/org/apache/cocoon/cocoon-template-impl/1.0.0-SNAPSHOT/cocoon-template-impl-1.0.0-20060620.032501-5.pom
2K downloaded
[INFO] snapshot org.apache.cocoon:cocoon-template:1-SNAPSHOT: checking for updates from apache.snapshots
Downloading: http://people.apache.org/repo/m2-snapshot-repository/org/apache/cocoon/cocoon-template/1-SNAPSHOT/cocoon-template-1-20060728.035303-12.pom
1K downloaded
[INFO] snapshot org.apache.cocoon:cocoon-forms-impl:1.0.0-SNAPSHOT: checking for updates from
apache.snapshots
Downloading: http://people.apache.org/repo/m2-snapshot-repository/org/apache/cocoon/cocoon-forms-impl/1.0.0-SNAPSHOT/cocoon-forms-impl-1.0.0-20060729.031852-27.pom
2K downloaded
[INFO] snapshot org.apache.cocoon:cocoon-ajax-impl:1.0.0-SNAPSHOT: checking for updates from
apache.snapshots
Downloading: http://people.apache.org/repo/m2-snapshot-repository/org/apache/cocoon/cocoon-ajax-impl/1.0.0-SNAPSHOT/cocoon-ajax-impl-1.0.0-20060728.032432-11.pom
1K downloaded
Downloading: http://repo1.maven.org/maven2/xreporter/xreporter-expression/r672/xreporter-expression-r672.pom
[WARNING] Unable to get resource from repository central (http://repo1.maven.org/maven2)
[INFO] snapshot org.apache.cocoon:cocoon-servlet-service-impl:1.0.0-RC1-SNAPSHOT: checking
for updates from apache.snapshots
Downloading: http://people.apache.org/repo/m2-snapshot-repository/org/apache/cocoon/cocoon-forms-impl/1.0.0-SNAPSHOT/cocoon-forms-impl-1.0.0-20060729.031852-27.jar
922K downloaded
Downloading: http://people.apache.org/repo/m2-snapshot-repository/org/apache/cocoon/cocoon-forms-sample/1.0.0-SNAPSHOT/cocoon-forms-sample-1.0.0-20060728.035423-7.jar
282K downloaded
Downloading: http://ibiblio.org/maven2/xreporter/xreporter-expression/r672/xreporter-expression-r672.jar
[WARNING] Unable to get resource from repository central (http://ibiblio.org/maven2)
Downloading: http://svn.apache.org/maven-snapshot-repository/xreporter/xreporter-expression/r672/xreporter-expression-r672.jar
[WARNING] Unable to get resource from repository apache.snapshot (http://svn.apache.org/maven-snapshot-repository)
Downloading: http://svn.apache.org/repository/xreporter/jars/xreporter-expression-r672.jar
88K downloaded
[WARNING] *** CHECKSUM FAILED - Checksum failed on download: local = 'e88adacaa9a6a3c23b835da10f2a787b637f89e1';
remote = 'SHA1' - RETRYING
Downloading: http://svn.apache.org/repository/xreporter/jars/xreporter-expression-r672.jar
88K downloaded
[WARNING] *** CHECKSUM FAILED - Checksum failed on download: local = 'e88adacaa9a6a3c23b835da10f2a787b637f89e1';
remote = 'SHA1' - IGNORING
Downloading: http://people.apache.org/repo/m2-snapshot-repository/org/apache/cocoon/cocoon-template-sample/1.0.0-SNAPSHOT/cocoon-template-sample-1.0.0-SNAPSHOT.jar
[WARNING] Unable to get resource from repository apache.snapshots (http://people.apache.org/repo/m2-snapshot-repository)
Downloading: http://people.apache.org/repo/m2-snapshot-repository/org/apache/cocoon/cocoon-template-impl/1.0.0-SNAPSHOT/cocoon-template-impl-1.0.0-20060620.032501-5.jar
151K downloaded
Downloading: http://people.apache.org/repo/m2-snapshot-repository/org/apache/cocoon/cocoon-core/2.2.0-RC1-SNAPSHOT/cocoon-core-2.2.0-RC1-SNAPSHOT.jar
[WARNING] Unable to get resource from repository apache.snapshots (http://people.apache.org/repo/m2-snapshot-repository)
Downloading: http://people.apache.org/repo/m2-snapshot-repository/org/apache/cocoon/cocoon-servlet-service-sample/1.0.0-SNAPSHOT/cocoon-servlet-service-sample-1.0.0-SNAPSHOT.jar
[WARNING] Unable to get resource from repository apache.snapshots (http://people.apache.org/repo/m2-snapshot-repository)
Downloading: http://people.apache.org/repo/m2-snapshot-repository/org/apache/cocoon/cocoon-ajax-impl/1.0.0-SNAPSHOT/cocoon-ajax-impl-1.0.0-20060728.032432-11.jar
2431K downloaded
Downloading: http://people.apache.org/repo/m2-snapshot-repository/org/apache/cocoon/cocoon-ajax-sample/1.0.0-SNAPSHOT/cocoon-ajax-sample-1.0.0-20060728.032537-5.jar
10K downloaded
Downloading: http://people.apache.org/repo/m2-snapshot-repository/org/apache/cocoon/cocoon-servlet-service-components/1.0.0-RC1-SNAPSHOT/cocoon-servlet-service-components-1.0.0-RC1-SNAPSHOT.jar
[WARNING] Unable to get resource from repository apache.snapshots (http://people.apache.org/repo/m2-snapshot-repository)
Downloading: http://people.apache.org/repo/m2-snapshot-repository/org/apache/cocoon/cocoon-core-main-sample/1.0.0-SNAPSHOT/cocoon-core-main-sample-1.0.0-SNAPSHOT.jar
[WARNING] Unable to get resource from repository apache.snapshots (http://people.apache.org/repo/m2-snapshot-repository)
[INFO] ------------------------------------------------------------------------
[ERROR] BUILD ERROR
[INFO] ------------------------------------------------------------------------
[INFO] Failed to resolve artifact.

Missing:
----------
1) org.apache.cocoon:cocoon-template-sample:jar:1.0.0-SNAPSHOT

  Try downloading the file manually from the project website.

  Then, install it using the command: 
      mvn install:install-file -DgroupId=org.apache.cocoon -DartifactId=cocoon-template-sample
\
          -Dversion=1.0.0-SNAPSHOT -Dpackaging=jar -Dfile=/path/to/file

  Path to dependency: 
  	1) org.apache.cocoon:cocoon-webapp:war:2.2.0-M2-SNAPSHOT
  	2) org.apache.cocoon:cocoon-template-sample:jar:1.0.0-SNAPSHOT

2) org.apache.cocoon:cocoon-core:jar:2.2.0-RC1-SNAPSHOT

  Try downloading the file manually from the project website.

  Then, install it using the command: 
      mvn install:install-file -DgroupId=org.apache.cocoon -DartifactId=cocoon-core \
          -Dversion=2.2.0-RC1-SNAPSHOT -Dpackaging=jar -Dfile=/path/to/file

  Path to dependency: 
  	1) org.apache.cocoon:cocoon-webapp:war:2.2.0-M2-SNAPSHOT
  	2) org.apache.cocoon:cocoon-core:jar:2.2.0-RC1-SNAPSHOT

3) org.apache.cocoon:cocoon-servlet-service-sample:jar:1.0.0-SNAPSHOT

  Try downloading the file manually from the project website.

  Then, install it using the command: 
      mvn install:install-file -DgroupId=org.apache.cocoon -DartifactId=cocoon-servlet-service-sample
\
          -Dversion=1.0.0-SNAPSHOT -Dpackaging=jar -Dfile=/path/to/file

  Path to dependency: 
  	1) org.apache.cocoon:cocoon-webapp:war:2.2.0-M2-SNAPSHOT
  	2) org.apache.cocoon:cocoon-servlet-service-sample:jar:1.0.0-SNAPSHOT

4) org.apache.cocoon:cocoon-servlet-service-components:jar:1.0.0-RC1-SNAPSHOT

  Try downloading the file manually from the project website.

  Then, install it using the command: 
      mvn install:install-file -DgroupId=org.apache.cocoon -DartifactId=cocoon-servlet-service-components
\
          -Dversion=1.0.0-RC1-SNAPSHOT -Dpackaging=jar -Dfile=/path/to/file

  Path to dependency: 
  	1) org.apache.cocoon:cocoon-webapp:war:2.2.0-M2-SNAPSHOT
  	2) org.apache.cocoon:cocoon-servlet-service-components:jar:1.0.0-RC1-SNAPSHOT

5) org.apache.cocoon:cocoon-core-main-sample:jar:1.0.0-SNAPSHOT

  Try downloading the file manually from the project website.

  Then, install it using the command: 
      mvn install:install-file -DgroupId=org.apache.cocoon -DartifactId=cocoon-core-main-sample
\
          -Dversion=1.0.0-SNAPSHOT -Dpackaging=jar -Dfile=/path/to/file

  Path to dependency: 
  	1) org.apache.cocoon:cocoon-webapp:war:2.2.0-M2-SNAPSHOT
  	2) org.apache.cocoon:cocoon-core-main-sample:jar:1.0.0-SNAPSHOT

----------
5 required artifacts are missing.

for artifact: 
  org.apache.cocoon:cocoon-webapp:war:2.2.0-M2-SNAPSHOT

from the specified remote repositories:
  central (http://repo1.maven.org/maven2),
  apache.snapshots (http://people.apache.org/repo/m2-snapshot-repository)


[INFO] ------------------------------------------------------------------------
[INFO] For more information, run Maven with the -e switch
[INFO] ------------------------------------------------------------------------
[INFO] Total time: 13 seconds
[INFO] Finished at: Tue Feb 27 16:26:08 PST 2007
[INFO] Final Memory: 8M/14M
[INFO] ------------------------------------------------------------------------

****************************************************************************



Mime
View raw message