cocoon-dev mailing list archives

Site index · List index
Message view « Date » · « Thread »
Top « Date » · « Thread »
From "Continuum@cocoon.zones.apache.org" <...@cocoon.apache.org>
Subject [continuum] BUILD FAILURE: Cocoon Thread Implementation
Date Tue, 09 Jan 2007 12:36:30 GMT
Online report : http://cocoon.zones.apache.org:12000/continuum/servlet/continuum/target/ProjectBuild.vm/view/ProjectBuild/id/73/buildId/1610
Build statistics:
  State: Failed
  Previous State: Ok
  Started at: Tue, 9 Jan 2007 12:36:19 +0000
  Finished at: Tue, 9 Jan 2007 12:36:30 +0000
  Total time: 10s
  Build Trigger: Schedule
  Exit code: 1
  Building machine hostname: cocoon.zones.apache.org
  Operating system : SunOS(unknown)
  Java version : 1.4.2_06(Sun Microsystems Inc.)

Changes
         cziegeler          Start removing dependencies to Avalon
             /cocoon/trunk/core/cocoon-thread/cocoon-thread-impl/src/main/java/org/apache/cocoon/components/thread/DefaultRunnableManager.java
            /cocoon/trunk/core/cocoon-thread/cocoon-thread-impl/src/main/java/org/apache/cocoon/components/thread/DefaultThreadPool.java
           cziegeler          Adopt to our general coding style
             /cocoon/trunk/core/cocoon-thread/cocoon-thread-impl/src/main/java/org/apache/cocoon/components/thread/DefaultThreadPool.java
           cziegeler          Migrate thread impl to pojo
             /cocoon/trunk/core/cocoon-core/src/main/resources/org/apache/cocoon/cocoon.roles
            /cocoon/trunk/core/cocoon-thread/cocoon-thread-impl/pom.xml
            /cocoon/trunk/core/cocoon-thread/cocoon-thread-impl/src/main/java/org/apache/cocoon/components/thread/DefaultRunnableManager.java
            /cocoon/trunk/core/cocoon-thread/cocoon-thread-impl/src/main/resources/META-INF/cocoon/avalon
            /cocoon/trunk/core/cocoon-thread/cocoon-thread-impl/src/main/resources/META-INF/cocoon/spring/cocoon-thread-impl.xml
            /cocoon/trunk/core/cocoon-thread/cocoon-thread-impl/src/test/java/org/apache/cocoon/components/thread/AbstractTestCase.java
            /cocoon/trunk/core/cocoon-thread/cocoon-thread-impl/src/test/java/org/apache/cocoon/components/thread/DefaultRunnableManagerTestCase.java
            /cocoon/trunk/core/cocoon-thread/cocoon-thread-impl/src/test/java/org/apache/cocoon/components/thread/DefaultThreadFactoryTestCase.java
            /cocoon/trunk/core/cocoon-thread/cocoon-thread-impl/src/test/java/org/apache/cocoon/components/thread/DefaultThreadPoolTestCase.java
        
****************************************************************************
Output:
****************************************************************************
[INFO] Scanning for projects...
[INFO] ----------------------------------------------------------------------------
[INFO] Building Cocoon Thread Implementation
[INFO]    task-segment: [clean, install]
[INFO] ----------------------------------------------------------------------------
[INFO] [clean:clean]
[INFO] Deleting directory /home/maven/continuum-data/working-directory/73/target
[INFO] [resources:resources]
[INFO] Using default encoding to copy filtered resources.
[INFO] snapshot org.apache.cocoon:cocoon-thread-api:1.0.0-SNAPSHOT: checking for updates from
apache.snapshot
[INFO] snapshot org.apache.cocoon:cocoon-thread-api:1.0.0-SNAPSHOT: checking for updates from
apache-cvs
[INFO] snapshot org.apache.cocoon:cocoon-thread-api:1.0.0-SNAPSHOT: checking for updates from
apache.snapshots
[INFO] [compiler:compile]
Compiling 7 source files to /home/maven/continuum-data/working-directory/73/target/classes
[INFO] [resources:testResources]
[INFO] Using default encoding to copy filtered resources.
[INFO] [compiler:testCompile]
Compiling 4 source files to /home/maven/continuum-data/working-directory/73/target/test-classes
[INFO] ------------------------------------------------------------------------
[ERROR] BUILD FAILURE
[INFO] ------------------------------------------------------------------------
[INFO] Compilation failure

/home/maven/continuum-data/working-directory/73/src/test/java/org/apache/cocoon/components/thread/DefaultThreadPoolTestCase.java:[19,42]
package org.apache.avalon.framework.logger does not exist

/home/maven/continuum-data/working-directory/73/src/test/java/org/apache/cocoon/components/thread/DefaultThreadPoolTestCase.java:[112,22]
cannot resolve symbol
symbol: class ConsoleLogger 
                final ConsoleLogger logger = new ConsoleLogger( ConsoleLogger.LEVEL_DEBUG
);

/home/maven/continuum-data/working-directory/73/src/test/java/org/apache/cocoon/components/thread/DefaultThreadPoolTestCase.java:[112,49]
cannot resolve symbol
symbol: class ConsoleLogger 
                final ConsoleLogger logger = new ConsoleLogger( ConsoleLogger.LEVEL_DEBUG
);

/home/maven/continuum-data/working-directory/73/src/test/java/org/apache/cocoon/components/thread/DefaultThreadPoolTestCase.java:[112,64]
cannot resolve symbol
symbol: variable ConsoleLogger 
                final ConsoleLogger logger = new ConsoleLogger( ConsoleLogger.LEVEL_DEBUG
);


[INFO] ------------------------------------------------------------------------
[INFO] For more information, run Maven with the -e switch
[INFO] ------------------------------------------------------------------------
[INFO] Total time: 9 seconds
[INFO] Finished at: Tue Jan 09 12:36:29 GMT 2007
[INFO] Final Memory: 6M/18M
[INFO] ------------------------------------------------------------------------

****************************************************************************



Mime
View raw message