cocoon-dev mailing list archives

Site index · List index
Message view « Date » · « Thread »
Top « Date » · « Thread »
From Joerg Heinicke <joerg.heini...@gmx.de>
Subject Re: [continuum] BUILD FAILURE: Forms Block Implementation
Date Sun, 07 Jan 2007 02:48:20 GMT
On 07.01.2007 01:15, Continuum@cocoon.zones.apache.org wrote:

> Online report : http://cocoon.zones.apache.org:12000/continuum/servlet/continuum/target/ProjectBuild.vm/view/ProjectBuild/id/15/buildId/1581

> Changes
>          joerg          COCOON-1471: Forms block: Add method to create binding from DOM
tree.
>              /cocoon/branches/BRANCH_2_1_X/status.xml
>             /cocoon/trunk/blocks/cocoon-forms/cocoon-forms-impl/src/main/java/org/apache/cocoon/forms/binding/BindingManager.java
>             /cocoon/trunk/blocks/cocoon-forms/cocoon-forms-impl/src/main/java/org/apache/cocoon/forms/binding/JXPathBindingManager.java
>             /cocoon/trunk/blocks/cocoon-forms/cocoon-forms-impl/src/main/resources/org/apache/cocoon/forms/flow/javascript/Form.js

> [INFO] [compiler:compile]
> Compiling 397 source files to /home/maven/continuum-data/working-directory/15/target/classes
> [INFO] [resources:testResources]
> [INFO] Using default encoding to copy filtered resources.
> [INFO] [compiler:testCompile]
> Compiling 11 source files to /home/maven/continuum-data/working-directory/15/target/test-classes
> [INFO] ------------------------------------------------------------------------
> [ERROR] BUILD FAILURE
> [INFO] ------------------------------------------------------------------------
> [INFO] Compilation failure

Was this failure in any way caused by my commit? The test case classes 
seem to miss everything. What can cause such failures? Did my commit 
(like any other commit would have done it) trigger anything special?

Regards
Jörg

Mime
View raw message