cocoon-dev mailing list archives

Site index · List index
Message view « Date » · « Thread »
Top « Date » · « Thread »
From "Continuum@cocoon.zones.apache.org" <...@cocoon.apache.org>
Subject [continuum] BUILD FAILURE: Forms Block Implementation
Date Sun, 07 Jan 2007 00:15:03 GMT
Online report : http://cocoon.zones.apache.org:12000/continuum/servlet/continuum/target/ProjectBuild.vm/view/ProjectBuild/id/15/buildId/1581
Build statistics:
  State: Failed
  Previous State: Failed
  Started at: Sun, 7 Jan 2007 00:14:34 +0000
  Finished at: Sun, 7 Jan 2007 00:15:03 +0000
  Total time: 28s
  Build Trigger: Schedule
  Exit code: 1
  Building machine hostname: cocoon.zones.apache.org
  Operating system : SunOS(unknown)
  Java version : 1.4.2_06(Sun Microsystems Inc.)

Changes
         joerg          COCOON-1471: Forms block: Add method to create binding from DOM tree.
             /cocoon/branches/BRANCH_2_1_X/status.xml
            /cocoon/trunk/blocks/cocoon-forms/cocoon-forms-impl/src/main/java/org/apache/cocoon/forms/binding/BindingManager.java
            /cocoon/trunk/blocks/cocoon-forms/cocoon-forms-impl/src/main/java/org/apache/cocoon/forms/binding/JXPathBindingManager.java
            /cocoon/trunk/blocks/cocoon-forms/cocoon-forms-impl/src/main/resources/org/apache/cocoon/forms/flow/javascript/Form.js
        
****************************************************************************
Output:
****************************************************************************
[INFO] Scanning for projects...
[INFO] ----------------------------------------------------------------------------
[INFO] Building Forms Block Implementation
[INFO]    task-segment: [clean, install]
[INFO] ----------------------------------------------------------------------------
[INFO] [clean:clean]
[INFO] Deleting directory /home/maven/continuum-data/working-directory/15/target
[INFO] [resources:resources]
[INFO] Using default encoding to copy filtered resources.
[INFO] snapshot org.apache.cocoon:cocoon-core:2.2.0-M3-SNAPSHOT: checking for updates from
apache.snapshot
[INFO] snapshot org.apache.cocoon:cocoon-core:2.2.0-M3-SNAPSHOT: checking for updates from
apache-cvs
[INFO] snapshot org.apache.cocoon:cocoon-core:2.2.0-M3-SNAPSHOT: checking for updates from
apache.snapshots
[INFO] snapshot org.apache.cocoon:cocoon-core-modules:3-SNAPSHOT: checking for updates from
apache.snapshot
[INFO] snapshot org.apache.cocoon:cocoon-core-modules:3-SNAPSHOT: checking for updates from
apache-cvs
[INFO] snapshot org.apache.cocoon:cocoon-core-modules:3-SNAPSHOT: checking for updates from
apache.snapshots
[INFO] snapshot org.apache.cocoon:cocoon-spring-configurator:1.0.0-SNAPSHOT: checking for
updates from apache.snapshot
[INFO] snapshot org.apache.cocoon:cocoon-spring-configurator:1.0.0-SNAPSHOT: checking for
updates from apache-cvs
[INFO] snapshot org.apache.cocoon:cocoon-spring-configurator:1.0.0-SNAPSHOT: checking for
updates from apache.snapshots
[INFO] snapshot org.apache.cocoon:cocoon-pipeline-components:1.0.0-SNAPSHOT: checking for
updates from apache.snapshot
[INFO] snapshot org.apache.cocoon:cocoon-pipeline-components:1.0.0-SNAPSHOT: checking for
updates from apache-cvs
[INFO] snapshot org.apache.cocoon:cocoon-pipeline-components:1.0.0-SNAPSHOT: checking for
updates from apache.snapshots
[INFO] snapshot org.apache.cocoon:cocoon-sitemap-components:1.0.0-SNAPSHOT: checking for updates
from apache.snapshot
[INFO] snapshot org.apache.cocoon:cocoon-sitemap-components:1.0.0-SNAPSHOT: checking for updates
from apache-cvs
[INFO] snapshot org.apache.cocoon:cocoon-sitemap-components:1.0.0-SNAPSHOT: checking for updates
from apache.snapshots
[INFO] snapshot org.apache.cocoon:cocoon-sitemap-impl:1.0.0-SNAPSHOT: checking for updates
from apache.snapshot
[INFO] snapshot org.apache.cocoon:cocoon-sitemap-impl:1.0.0-SNAPSHOT: checking for updates
from apache-cvs
[INFO] snapshot org.apache.cocoon:cocoon-sitemap-impl:1.0.0-SNAPSHOT: checking for updates
from apache.snapshots
[INFO] snapshot org.apache.cocoon:cocoon-sitemap-api:1.0.0-SNAPSHOT: checking for updates
from apache.snapshot
[INFO] snapshot org.apache.cocoon:cocoon-sitemap-api:1.0.0-SNAPSHOT: checking for updates
from apache-cvs
[INFO] snapshot org.apache.cocoon:cocoon-sitemap-api:1.0.0-SNAPSHOT: checking for updates
from apache.snapshots
[INFO] snapshot org.apache.cocoon:cocoon-thread-api:1.0.0-SNAPSHOT: checking for updates from
apache.snapshot
[INFO] snapshot org.apache.cocoon:cocoon-thread-api:1.0.0-SNAPSHOT: checking for updates from
apache-cvs
[INFO] snapshot org.apache.cocoon:cocoon-thread-api:1.0.0-SNAPSHOT: checking for updates from
apache.snapshots
[INFO] snapshot org.apache.cocoon:cocoon-xml-resolver:1.0.0-SNAPSHOT: checking for updates
from apache.snapshot
[INFO] snapshot org.apache.cocoon:cocoon-xml-resolver:1.0.0-SNAPSHOT: checking for updates
from apache-cvs
[INFO] snapshot org.apache.cocoon:cocoon-xml-resolver:1.0.0-SNAPSHOT: checking for updates
from apache.snapshots
[INFO] snapshot org.apache.cocoon:cocoon-xml-impl:1.0.0-SNAPSHOT: checking for updates from
apache.snapshot
[INFO] snapshot org.apache.cocoon:cocoon-xml-impl:1.0.0-SNAPSHOT: checking for updates from
apache-cvs
[INFO] snapshot org.apache.cocoon:cocoon-xml-impl:1.0.0-SNAPSHOT: checking for updates from
apache.snapshots
[INFO] snapshot org.apache.cocoon:cocoon-store-impl:1.0.0-SNAPSHOT: checking for updates from
apache.snapshot
[INFO] snapshot org.apache.cocoon:cocoon-store-impl:1.0.0-SNAPSHOT: checking for updates from
apache-cvs
[INFO] snapshot org.apache.cocoon:cocoon-store-impl:1.0.0-SNAPSHOT: checking for updates from
apache.snapshots
[INFO] snapshot org.apache.cocoon:cocoon-thread-impl:1.0.0-SNAPSHOT: checking for updates
from apache.snapshot
[INFO] snapshot org.apache.cocoon:cocoon-thread-impl:1.0.0-SNAPSHOT: checking for updates
from apache-cvs
[INFO] snapshot org.apache.cocoon:cocoon-thread-impl:1.0.0-SNAPSHOT: checking for updates
from apache.snapshots
[INFO] snapshot org.apache.cocoon:cocoon-flowscript-impl:1.0.0-M2-SNAPSHOT: checking for updates
from apache.snapshot
[INFO] snapshot org.apache.cocoon:cocoon-flowscript-impl:1.0.0-M2-SNAPSHOT: checking for updates
from apache-cvs
[INFO] snapshot org.apache.cocoon:cocoon-flowscript-impl:1.0.0-M2-SNAPSHOT: checking for updates
from apache.snapshots
[INFO] snapshot org.apache.cocoon:cocoon-flowscript:2-SNAPSHOT: checking for updates from
apache.snapshot
[INFO] snapshot org.apache.cocoon:cocoon-flowscript:2-SNAPSHOT: checking for updates from
apache-cvs
[INFO] snapshot org.apache.cocoon:cocoon-flowscript:2-SNAPSHOT: checking for updates from
apache.snapshots
[INFO] snapshot org.apache.cocoon:cocoon-ajax-impl:1.0.0-M2-SNAPSHOT: checking for updates
from apache.snapshot
[INFO] snapshot org.apache.cocoon:cocoon-ajax-impl:1.0.0-M2-SNAPSHOT: checking for updates
from apache-cvs
[INFO] snapshot org.apache.cocoon:cocoon-ajax-impl:1.0.0-M2-SNAPSHOT: checking for updates
from apache.snapshots
[INFO] snapshot org.apache.cocoon:cocoon-ajax:2-SNAPSHOT: checking for updates from apache.snapshot
[INFO] snapshot org.apache.cocoon:cocoon-ajax:2-SNAPSHOT: checking for updates from apache-cvs
[INFO] snapshot org.apache.cocoon:cocoon-ajax:2-SNAPSHOT: checking for updates from apache.snapshots
[WARNING] 
	Artifact junit:junit:jar:3.8.2:test retains local scope 'test' overriding broader scope 'compile'
	given by a dependency. If this is not intended, modify or remove the local scope.

[INFO] [compiler:compile]
Compiling 397 source files to /home/maven/continuum-data/working-directory/15/target/classes
[INFO] [resources:testResources]
[INFO] Using default encoding to copy filtered resources.
[INFO] [compiler:testCompile]
Compiling 11 source files to /home/maven/continuum-data/working-directory/15/target/test-classes
[INFO] ------------------------------------------------------------------------
[ERROR] BUILD FAILURE
[INFO] ------------------------------------------------------------------------
[INFO] Compilation failure

/home/maven/continuum-data/working-directory/15/src/test/java/org/apache/cocoon/forms/datatype/FlowJXPathSelectionListTestCase.java:[35,42]
package org.apache.cocoon.environment.mock does not exist

/home/maven/continuum-data/working-directory/15/src/test/java/org/apache/cocoon/forms/datatype/AbstractSelectionListTestCase.java:[28,40]
package org.apache.cocoon.core.container does not exist

/home/maven/continuum-data/working-directory/15/src/test/java/org/apache/cocoon/forms/datatype/AbstractSelectionListTestCase.java:[38,60]
cannot resolve symbol
symbol  : class ContainerTestCase 
location: class org.apache.cocoon.forms.datatype.AbstractSelectionListTestCase

/home/maven/continuum-data/working-directory/15/src/test/java/org/apache/cocoon/forms/formmodel/FieldTestCase.java:[20,40]
package org.apache.cocoon.core.container does not exist

/home/maven/continuum-data/working-directory/15/src/test/java/org/apache/cocoon/forms/formmodel/FieldTestCase.java:[21,42]
package org.apache.cocoon.environment.mock does not exist

/home/maven/continuum-data/working-directory/15/src/test/java/org/apache/cocoon/forms/formmodel/FieldTestCase.java:[33,35]
cannot resolve symbol
symbol  : class ContainerTestCase 
location: class org.apache.cocoon.forms.formmodel.FieldTestCase

/home/maven/continuum-data/working-directory/15/src/test/java/org/apache/cocoon/forms/formmodel/GroupTestCase.java:[22,40]
package org.apache.cocoon.core.container does not exist

/home/maven/continuum-data/working-directory/15/src/test/java/org/apache/cocoon/forms/formmodel/GroupTestCase.java:[31,35]
cannot resolve symbol
symbol  : class ContainerTestCase 
location: class org.apache.cocoon.forms.formmodel.GroupTestCase

/home/maven/continuum-data/working-directory/15/src/test/java/org/apache/cocoon/forms/datatype/AbstractSelectionListTestCase.java:[47,8]
cannot resolve symbol
symbol  : variable super 
location: class org.apache.cocoon.forms.datatype.AbstractSelectionListTestCase

/home/maven/continuum-data/working-directory/15/src/test/java/org/apache/cocoon/forms/datatype/AbstractSelectionListTestCase.java:[48,49]
cannot resolve symbol
symbol  : method lookup (java.lang.String)
location: class org.apache.cocoon.forms.datatype.AbstractSelectionListTestCase

/home/maven/continuum-data/working-directory/15/src/test/java/org/apache/cocoon/forms/datatype/AbstractSelectionListTestCase.java:[59,12]
cannot resolve symbol
symbol  : method release (org.apache.cocoon.forms.datatype.DatatypeManager)
location: class org.apache.cocoon.forms.datatype.AbstractSelectionListTestCase

/home/maven/continuum-data/working-directory/15/src/test/java/org/apache/cocoon/forms/datatype/AbstractSelectionListTestCase.java:[61,8]
cannot resolve symbol
symbol  : variable super 
location: class org.apache.cocoon.forms.datatype.AbstractSelectionListTestCase

/home/maven/continuum-data/working-directory/15/src/test/java/org/apache/cocoon/forms/datatype/AbstractSelectionListTestCase.java:[75,8]
cannot resolve symbol
symbol  : method assertTrue (java.lang.String,boolean)
location: class org.apache.cocoon.forms.datatype.AbstractSelectionListTestCase

/home/maven/continuum-data/working-directory/15/src/test/java/org/apache/cocoon/forms/datatype/FlowJXPathSelectionListTestCase.java:[60,30]
cannot resolve symbol
symbol  : class MockRequest 
location: class org.apache.cocoon.forms.datatype.FlowJXPathSelectionListTestCase

/home/maven/continuum-data/working-directory/15/src/test/java/org/apache/cocoon/forms/datatype/FlowJXPathSelectionListTestCase.java:[92,30]
cannot resolve symbol
symbol  : class MockRequest 
location: class org.apache.cocoon.forms.datatype.FlowJXPathSelectionListTestCase

/home/maven/continuum-data/working-directory/15/src/test/java/org/apache/cocoon/forms/formmodel/FieldTestCase.java:[43,46]
cannot resolve symbol
symbol  : method getManager ()
location: class org.apache.cocoon.forms.formmodel.FieldTestCase

/home/maven/continuum-data/working-directory/15/src/test/java/org/apache/cocoon/forms/formmodel/FieldTestCase.java:[46,8]
cannot resolve symbol
symbol  : class MockRequest 
location: class org.apache.cocoon.forms.formmodel.FieldTestCase

/home/maven/continuum-data/working-directory/15/src/test/java/org/apache/cocoon/forms/formmodel/FieldTestCase.java:[48,22]
cannot resolve symbol
symbol  : class MockRequest 
location: class org.apache.cocoon.forms.formmodel.FieldTestCase

/home/maven/continuum-data/working-directory/15/src/test/java/org/apache/cocoon/forms/formmodel/FieldTestCase.java:[59,8]
cannot resolve symbol
symbol  : method assertEquals (java.lang.String,java.lang.Integer,java.lang.Object)
location: class org.apache.cocoon.forms.formmodel.FieldTestCase

/home/maven/continuum-data/working-directory/15/src/test/java/org/apache/cocoon/forms/formmodel/FieldTestCase.java:[65,8]
cannot resolve symbol
symbol  : method assertTrue (java.lang.String,boolean)
location: class org.apache.cocoon.forms.formmodel.FieldTestCase

/home/maven/continuum-data/working-directory/15/src/test/java/org/apache/cocoon/forms/formmodel/FieldTestCase.java:[66,8]
cannot resolve symbol
symbol  : method assertNull (java.lang.String,org.apache.cocoon.forms.validation.ValidationError)
location: class org.apache.cocoon.forms.formmodel.FieldTestCase

/home/maven/continuum-data/working-directory/15/src/test/java/org/apache/cocoon/forms/formmodel/FieldTestCase.java:[75,46]
cannot resolve symbol
symbol  : method getManager ()
location: class org.apache.cocoon.forms.formmodel.FieldTestCase

/home/maven/continuum-data/working-directory/15/src/test/java/org/apache/cocoon/forms/formmodel/FieldTestCase.java:[78,8]
cannot resolve symbol
symbol  : class MockRequest 
location: class org.apache.cocoon.forms.formmodel.FieldTestCase

/home/maven/continuum-data/working-directory/15/src/test/java/org/apache/cocoon/forms/formmodel/FieldTestCase.java:[80,22]
cannot resolve symbol
symbol  : class MockRequest 
location: class org.apache.cocoon.forms.formmodel.FieldTestCase

/home/maven/continuum-data/working-directory/15/src/test/java/org/apache/cocoon/forms/formmodel/FieldTestCase.java:[91,8]
cannot resolve symbol
symbol  : method assertNull (java.lang.String,java.lang.Object)
location: class org.apache.cocoon.forms.formmodel.FieldTestCase

/home/maven/continuum-data/working-directory/15/src/test/java/org/apache/cocoon/forms/formmodel/FieldTestCase.java:[98,8]
cannot resolve symbol
symbol  : method assertFalse (java.lang.String,boolean)
location: class org.apache.cocoon.forms.formmodel.FieldTestCase

/home/maven/continuum-data/working-directory/15/src/test/java/org/apache/cocoon/forms/formmodel/FieldTestCase.java:[102,8]
cannot resolve symbol
symbol  : method assertNotNull (java.lang.String,org.apache.cocoon.forms.validation.ValidationError)
location: class org.apache.cocoon.forms.formmodel.FieldTestCase

/home/maven/continuum-data/working-directory/15/src/test/java/org/apache/cocoon/forms/formmodel/FieldTestCase.java:[109,46]
cannot resolve symbol
symbol  : method getManager ()
location: class org.apache.cocoon.forms.formmodel.FieldTestCase

/home/maven/continuum-data/working-directory/15/src/test/java/org/apache/cocoon/forms/formmodel/FieldTestCase.java:[112,8]
cannot resolve symbol
symbol  : class MockRequest 
location: class org.apache.cocoon.forms.formmodel.FieldTestCase

/home/maven/continuum-data/working-directory/15/src/test/java/org/apache/cocoon/forms/formmodel/FieldTestCase.java:[114,22]
cannot resolve symbol
symbol  : class MockRequest 
location: class org.apache.cocoon.forms.formmodel.FieldTestCase

/home/maven/continuum-data/working-directory/15/src/test/java/org/apache/cocoon/forms/formmodel/FieldTestCase.java:[125,8]
cannot resolve symbol
symbol  : method assertNull (java.lang.String,java.lang.Object)
location: class org.apache.cocoon.forms.formmodel.FieldTestCase

/home/maven/continuum-data/working-directory/15/src/test/java/org/apache/cocoon/forms/formmodel/FieldTestCase.java:[131,8]
cannot resolve symbol
symbol  : method assertFalse (java.lang.String,boolean)
location: class org.apache.cocoon.forms.formmodel.FieldTestCase

/home/maven/continuum-data/working-directory/15/src/test/java/org/apache/cocoon/forms/formmodel/FieldTestCase.java:[134,8]
cannot resolve symbol
symbol  : method assertNotNull (java.lang.String,org.apache.cocoon.forms.validation.ValidationError)
location: class org.apache.cocoon.forms.formmodel.FieldTestCase

/home/maven/continuum-data/working-directory/15/src/test/java/org/apache/cocoon/forms/formmodel/FieldTestCase.java:[143,46]
cannot resolve symbol
symbol  : method getManager ()
location: class org.apache.cocoon.forms.formmodel.FieldTestCase

/home/maven/continuum-data/working-directory/15/src/test/java/org/apache/cocoon/forms/formmodel/FieldTestCase.java:[146,8]
cannot resolve symbol
symbol  : class MockRequest 
location: class org.apache.cocoon.forms.formmodel.FieldTestCase

/home/maven/continuum-data/working-directory/15/src/test/java/org/apache/cocoon/forms/formmodel/FieldTestCase.java:[150,22]
cannot resolve symbol
symbol  : class MockRequest 
location: class org.apache.cocoon.forms.formmodel.FieldTestCase

/home/maven/continuum-data/working-directory/15/src/test/java/org/apache/cocoon/forms/formmodel/FieldTestCase.java:[156,8]
cannot resolve symbol
symbol  : method assertEquals (java.lang.String,org.apache.cocoon.forms.formmodel.Action,org.apache.cocoon.forms.formmodel.Widget)
location: class org.apache.cocoon.forms.formmodel.FieldTestCase

/home/maven/continuum-data/working-directory/15/src/test/java/org/apache/cocoon/forms/formmodel/FieldTestCase.java:[165,8]
cannot resolve symbol
symbol  : method assertEquals (java.lang.String,java.lang.String,java.lang.String)
location: class org.apache.cocoon.forms.formmodel.FieldTestCase

/home/maven/continuum-data/working-directory/15/src/test/java/org/apache/cocoon/forms/formmodel/FieldTestCase.java:[166,8]
cannot resolve symbol
symbol  : method assertEquals (java.lang.String,java.lang.String,java.lang.String)
location: class org.apache.cocoon.forms.formmodel.FieldTestCase

/home/maven/continuum-data/working-directory/15/src/test/java/org/apache/cocoon/forms/formmodel/FieldTestCase.java:[174,46]
cannot resolve symbol
symbol  : method getManager ()
location: class org.apache.cocoon.forms.formmodel.FieldTestCase

/home/maven/continuum-data/working-directory/15/src/test/java/org/apache/cocoon/forms/formmodel/FieldTestCase.java:[177,8]
cannot resolve symbol
symbol  : class MockRequest 
location: class org.apache.cocoon.forms.formmodel.FieldTestCase

/home/maven/continuum-data/working-directory/15/src/test/java/org/apache/cocoon/forms/formmodel/FieldTestCase.java:[181,22]
cannot resolve symbol
symbol  : class MockRequest 
location: class org.apache.cocoon.forms.formmodel.FieldTestCase

/home/maven/continuum-data/working-directory/15/src/test/java/org/apache/cocoon/forms/formmodel/FieldTestCase.java:[189,16]
cannot resolve symbol
symbol: method assertEquals (java.lang.String,java.lang.String,java.lang.String)
                assertEquals("Old value", "foo", (String)event.getOldValue());

/home/maven/continuum-data/working-directory/15/src/test/java/org/apache/cocoon/forms/formmodel/FieldTestCase.java:[190,16]
cannot resolve symbol
symbol: method assertEquals (java.lang.String,java.lang.String,java.lang.String)
                assertEquals("New value", "bar", (String)event.getNewValue());

/home/maven/continuum-data/working-directory/15/src/test/java/org/apache/cocoon/forms/formmodel/FieldTestCase.java:[196,22]
cannot resolve symbol
symbol  : class MockRequest 
location: class org.apache.cocoon.forms.formmodel.FieldTestCase

/home/maven/continuum-data/working-directory/15/src/test/java/org/apache/cocoon/forms/formmodel/FieldTestCase.java:[206,46]
cannot resolve symbol
symbol  : method getManager ()
location: class org.apache.cocoon.forms.formmodel.FieldTestCase

/home/maven/continuum-data/working-directory/15/src/test/java/org/apache/cocoon/forms/formmodel/FieldTestCase.java:[208,8]
cannot resolve symbol
symbol  : class MockRequest 
location: class org.apache.cocoon.forms.formmodel.FieldTestCase

/home/maven/continuum-data/working-directory/15/src/test/java/org/apache/cocoon/forms/formmodel/FieldTestCase.java:[214,22]
cannot resolve symbol
symbol  : class MockRequest 
location: class org.apache.cocoon.forms.formmodel.FieldTestCase

/home/maven/continuum-data/working-directory/15/src/test/java/org/apache/cocoon/forms/formmodel/FieldTestCase.java:[219,8]
cannot resolve symbol
symbol  : method assertEquals (java.lang.String,java.lang.Object)
location: class org.apache.cocoon.forms.formmodel.FieldTestCase

/home/maven/continuum-data/working-directory/15/src/test/java/org/apache/cocoon/forms/formmodel/FieldTestCase.java:[226,8]
cannot resolve symbol
symbol  : method assertEquals (java.lang.String,java.lang.Object)
location: class org.apache.cocoon.forms.formmodel.FieldTestCase

/home/maven/continuum-data/working-directory/15/src/test/java/org/apache/cocoon/forms/formmodel/GroupTestCase.java:[37,46]
cannot resolve symbol
symbol  : method getManager ()
location: class org.apache.cocoon.forms.formmodel.GroupTestCase

/home/maven/continuum-data/working-directory/15/src/test/java/org/apache/cocoon/forms/datatype/DynamicSelectionListTestCase.java:[53,53]
cannot resolve symbol
symbol  : method getManager ()
location: class org.apache.cocoon.forms.datatype.DynamicSelectionListTestCase


[INFO] ------------------------------------------------------------------------
[INFO] For more information, run Maven with the -e switch
[INFO] ------------------------------------------------------------------------
[INFO] Total time: 27 seconds
[INFO] Finished at: Sun Jan 07 00:15:02 GMT 2007
[INFO] Final Memory: 11M/36M
[INFO] ------------------------------------------------------------------------

****************************************************************************



Mime
View raw message