cocoon-dev mailing list archives

Site index · List index
Message view « Date » · « Thread »
Top « Date » · « Thread »
From "Continuum@cocoon.zones.apache.org" <...@cocoon.apache.org>
Subject [continuum] BUILD FAILURE: Cocoon Pipeline Implementation
Date Tue, 02 Jan 2007 00:21:33 GMT
Online report : http://cocoon.zones.apache.org:12000/continuum/servlet/continuum/target/ProjectBuild.vm/view/ProjectBuild/id/68/buildId/1454
Build statistics:
  State: Failed
  Previous State: Failed
  Started at: Tue, 2 Jan 2007 00:21:06 +0000
  Finished at: Tue, 2 Jan 2007 00:21:33 +0000
  Total time: 26s
  Build Trigger: Schedule
  Exit code: 1
  Building machine hostname: cocoon.zones.apache.org
  Operating system : SunOS(unknown)
  Java version : 1.4.2_06(Sun Microsystems Inc.)

Changes
         danielf          Refactoring of AbstractTextSerializer to make the extending serializers
HTMLSerializer, TextSerializer and XMLSerializer POJOs. The Avalon functionality is kept for
backward compatibility. There is also a (deactivated) Spring configuration file that not is
complete yet as we still have to find a way for handling the mime settings for sitemap components.
I have only been able to do limited testing of the new functionality as the mime type handling
not work yet while configuring the serializers as Spring beans. But they at least seem to
be set up correctly.
             /cocoon/trunk/core/cocoon-pipeline/cocoon-pipeline-components/src/main/java/org/apache/cocoon/serialization/HTMLSerializer.java
            /cocoon/trunk/core/cocoon-pipeline/cocoon-pipeline-components/src/main/java/org/apache/cocoon/serialization/TextSerializer.java
            /cocoon/trunk/core/cocoon-pipeline/cocoon-pipeline-components/src/main/java/org/apache/cocoon/serialization/XMLSerializer.java
            /cocoon/trunk/core/cocoon-pipeline/cocoon-pipeline-components/src/main/resources/META-INF/cocoon/spring/cocoon-core-serializers.notyet
            /cocoon/trunk/core/cocoon-pipeline/cocoon-pipeline-impl/src/main/java/org/apache/cocoon/serialization/AbstractTextSerializer.java
        
****************************************************************************
Output:
****************************************************************************
[INFO] Scanning for projects...
[INFO] ----------------------------------------------------------------------------
[INFO] Building Cocoon Pipeline Implementation
[INFO]    task-segment: [clean, install]
[INFO] ----------------------------------------------------------------------------
[INFO] [clean:clean]
[INFO] Deleting directory /home/maven/continuum-data/working-directory/68/target
[INFO] [resources:resources]
[INFO] Using default encoding to copy filtered resources.
[INFO] snapshot org.apache.cocoon:cocoon-pipeline-api:1.0.0-SNAPSHOT: checking for updates
from apache.snapshot
[INFO] snapshot org.apache.cocoon:cocoon-pipeline-api:1.0.0-SNAPSHOT: checking for updates
from apache-cvs
[INFO] snapshot org.apache.cocoon:cocoon-pipeline-api:1.0.0-SNAPSHOT: checking for updates
from apache.snapshots
[INFO] snapshot org.apache.cocoon:cocoon-environment-api:1.0.0-SNAPSHOT: checking for updates
from apache.snapshot
[INFO] snapshot org.apache.cocoon:cocoon-environment-api:1.0.0-SNAPSHOT: checking for updates
from apache-cvs
[INFO] snapshot org.apache.cocoon:cocoon-environment-api:1.0.0-SNAPSHOT: checking for updates
from apache.snapshots
[INFO] snapshot org.apache.cocoon:cocoon-environment:2-SNAPSHOT: checking for updates from
apache.snapshot
[INFO] snapshot org.apache.cocoon:cocoon-environment:2-SNAPSHOT: checking for updates from
apache-cvs
[INFO] snapshot org.apache.cocoon:cocoon-environment:2-SNAPSHOT: checking for updates from
apache.snapshots
[INFO] snapshot org.apache.cocoon:cocoon-common:1.0.0-SNAPSHOT: checking for updates from
apache.snapshot
[INFO] snapshot org.apache.cocoon:cocoon-common:1.0.0-SNAPSHOT: checking for updates from
apache-cvs
[INFO] snapshot org.apache.cocoon:cocoon-common:1.0.0-SNAPSHOT: checking for updates from
apache.snapshots
[INFO] [compiler:compile]
Compiling 80 source files to /home/maven/continuum-data/working-directory/68/target/classes
[INFO] ------------------------------------------------------------------------
[ERROR] BUILD FAILURE
[INFO] ------------------------------------------------------------------------
[INFO] Compilation failure

/home/maven/continuum-data/working-directory/68/src/main/java/org/apache/cocoon/xml/AbstractSAXFragment.java:[33,53]
cannot resolve symbol
symbol  : class XMLFragment 
location: class org.apache.cocoon.xml.AbstractSAXFragment

/home/maven/continuum-data/working-directory/68/src/main/java/org/apache/cocoon/components/pipeline/impl/AbstractCachingProcessingPipeline.java:[30,33]
cannot resolve symbol
symbol  : class CacheableProcessingComponent 
location: package caching

/home/maven/continuum-data/working-directory/68/src/main/java/org/apache/cocoon/components/pipeline/impl/AbstractCachingProcessingPipeline.java:[31,33]
cannot resolve symbol
symbol  : class CachedResponse 
location: package caching

/home/maven/continuum-data/working-directory/68/src/main/java/org/apache/cocoon/components/pipeline/impl/BaseCachingProcessingPipeline.java:[23,33]
cannot resolve symbol
symbol  : class Cache 
location: package caching

/home/maven/continuum-data/working-directory/68/src/main/java/org/apache/cocoon/components/pipeline/impl/AbstractCachingProcessingPipeline.java:[68,14]
cannot resolve symbol
symbol  : class CachedResponse 
location: class org.apache.cocoon.components.pipeline.impl.AbstractCachingProcessingPipeline

/home/maven/continuum-data/working-directory/68/src/main/java/org/apache/cocoon/components/pipeline/impl/BaseCachingProcessingPipeline.java:[40,14]
cannot resolve symbol
symbol  : class Cache 
location: class org.apache.cocoon.components.pipeline.impl.BaseCachingProcessingPipeline

/home/maven/continuum-data/working-directory/68/src/main/java/org/apache/cocoon/components/pipeline/impl/ExpiresCachingProcessingPipeline.java:[23,33]
cannot resolve symbol
symbol  : class CachedResponse 
location: package caching

/home/maven/continuum-data/working-directory/68/src/main/java/org/apache/cocoon/components/pipeline/impl/ExpiresCachingProcessingPipeline.java:[74,14]
cannot resolve symbol
symbol  : class CachedResponse 
location: class org.apache.cocoon.components.pipeline.impl.ExpiresCachingProcessingPipeline

/home/maven/continuum-data/working-directory/68/src/main/java/org/apache/cocoon/xml/xlink/XLinkPipe.java:[35,67]
cannot resolve symbol
symbol  : class XLinkHandler 
location: class org.apache.cocoon.xml.xlink.XLinkPipe

/home/maven/continuum-data/working-directory/68/src/main/java/org/apache/cocoon/caching/impl/CacheImpl.java:[32,33]
cannot resolve symbol
symbol  : class Cache 
location: package caching

/home/maven/continuum-data/working-directory/68/src/main/java/org/apache/cocoon/caching/impl/CacheImpl.java:[33,33]
cannot resolve symbol
symbol  : class CachedResponse 
location: package caching

/home/maven/continuum-data/working-directory/68/src/main/java/org/apache/cocoon/caching/impl/CacheImpl.java:[47,11]
cannot resolve symbol
symbol  : class Cache 
location: class org.apache.cocoon.caching.impl.CacheImpl

/home/maven/continuum-data/working-directory/68/src/main/java/org/apache/cocoon/caching/impl/CacheImpl.java:[80,22]
cannot resolve symbol
symbol  : class CachedResponse 
location: class org.apache.cocoon.caching.impl.CacheImpl

/home/maven/continuum-data/working-directory/68/src/main/java/org/apache/cocoon/caching/impl/CacheImpl.java:[98,11]
cannot resolve symbol
symbol  : class CachedResponse 
location: class org.apache.cocoon.caching.impl.CacheImpl

/home/maven/continuum-data/working-directory/68/src/main/java/org/apache/cocoon/components/pipeline/impl/CachingProcessingPipeline.java:[24,33]
cannot resolve symbol
symbol  : class CachedResponse 
location: package caching

/home/maven/continuum-data/working-directory/68/src/main/java/org/apache/cocoon/components/pipeline/impl/CachingPointProcessingPipeline.java:[28,33]
cannot resolve symbol
symbol  : class CachedResponse 
location: package caching

/home/maven/continuum-data/working-directory/68/src/main/java/org/apache/cocoon/serialization/AbstractTextSerializer.java:[26,33]
cannot resolve symbol
symbol  : class CacheableProcessingComponent 
location: package caching

/home/maven/continuum-data/working-directory/68/src/main/java/org/apache/cocoon/serialization/AbstractTextSerializer.java:[64,46]
cannot resolve symbol
symbol  : class CacheableProcessingComponent 
location: class org.apache.cocoon.serialization.AbstractTextSerializer

/home/maven/continuum-data/working-directory/68/src/main/java/org/apache/cocoon/xml/AbstractSAXFragment.java:[40,8]
cannot resolve symbol
symbol  : method toSAX (org.apache.cocoon.xml.dom.DOMBuilder)
location: class org.apache.cocoon.xml.AbstractSAXFragment

/home/maven/continuum-data/working-directory/68/src/main/java/org/apache/cocoon/components/pipeline/impl/BaseCachingProcessingPipeline.java:[55,61]
cannot resolve symbol
symbol  : variable Cache 
location: class org.apache.cocoon.components.pipeline.impl.BaseCachingProcessingPipeline

/home/maven/continuum-data/working-directory/68/src/main/java/org/apache/cocoon/components/pipeline/impl/BaseCachingProcessingPipeline.java:[61,26]
cannot resolve symbol
symbol  : class Cache 
location: class org.apache.cocoon.components.pipeline.impl.BaseCachingProcessingPipeline

/home/maven/continuum-data/working-directory/68/src/main/java/org/apache/cocoon/components/pipeline/impl/AbstractCachingProcessingPipeline.java:[400,39]
cannot resolve symbol
symbol  : class CacheableProcessingComponent 
location: class org.apache.cocoon.components.pipeline.impl.AbstractCachingProcessingPipeline

/home/maven/continuum-data/working-directory/68/src/main/java/org/apache/cocoon/components/pipeline/impl/AbstractCachingProcessingPipeline.java:[401,20]
cannot resolve symbol
symbol  : class CacheableProcessingComponent 
location: class org.apache.cocoon.components.pipeline.impl.AbstractCachingProcessingPipeline

/home/maven/continuum-data/working-directory/68/src/main/java/org/apache/cocoon/components/pipeline/impl/AbstractCachingProcessingPipeline.java:[419,37]
cannot resolve symbol
symbol  : class CacheableProcessingComponent 
location: class org.apache.cocoon.components.pipeline.impl.AbstractCachingProcessingPipeline

/home/maven/continuum-data/working-directory/68/src/main/java/org/apache/cocoon/components/pipeline/impl/AbstractCachingProcessingPipeline.java:[420,28]
cannot resolve symbol
symbol  : class CacheableProcessingComponent 
location: class org.apache.cocoon.components.pipeline.impl.AbstractCachingProcessingPipeline

/home/maven/continuum-data/working-directory/68/src/main/java/org/apache/cocoon/components/pipeline/impl/AbstractCachingProcessingPipeline.java:[441,48]
cannot resolve symbol
symbol  : class CacheableProcessingComponent 
location: class org.apache.cocoon.components.pipeline.impl.AbstractCachingProcessingPipeline

/home/maven/continuum-data/working-directory/68/src/main/java/org/apache/cocoon/components/pipeline/impl/AbstractCachingProcessingPipeline.java:[442,28]
cannot resolve symbol
symbol  : class CacheableProcessingComponent 
location: class org.apache.cocoon.components.pipeline.impl.AbstractCachingProcessingPipeline

/home/maven/continuum-data/working-directory/68/src/main/java/org/apache/cocoon/components/pipeline/impl/AbstractCachingProcessingPipeline.java:[526,18]
cannot resolve symbol
symbol  : class CachedResponse 
location: class org.apache.cocoon.components.pipeline.impl.AbstractCachingProcessingPipeline

/home/maven/continuum-data/working-directory/68/src/main/java/org/apache/cocoon/components/pipeline/impl/AbstractCachingProcessingPipeline.java:[755,40]
cannot resolve symbol
symbol  : class CacheableProcessingComponent 
location: class org.apache.cocoon.components.pipeline.impl.AbstractCachingProcessingPipeline

/home/maven/continuum-data/working-directory/68/src/main/java/org/apache/cocoon/components/pipeline/impl/AbstractCachingProcessingPipeline.java:[756,30]
cannot resolve symbol
symbol  : class CacheableProcessingComponent 
location: class org.apache.cocoon.components.pipeline.impl.AbstractCachingProcessingPipeline

/home/maven/continuum-data/working-directory/68/src/main/java/org/apache/cocoon/components/pipeline/impl/AbstractCachingProcessingPipeline.java:[772,20]
cannot resolve symbol
symbol  : class CachedResponse 
location: class org.apache.cocoon.components.pipeline.impl.AbstractCachingProcessingPipeline

/home/maven/continuum-data/working-directory/68/src/main/java/org/apache/cocoon/components/pipeline/impl/AbstractCachingProcessingPipeline.java:[794,51]
cannot resolve symbol
symbol  : class CacheableProcessingComponent 
location: class org.apache.cocoon.components.pipeline.impl.AbstractCachingProcessingPipeline

/home/maven/continuum-data/working-directory/68/src/main/java/org/apache/cocoon/components/pipeline/impl/AbstractCachingProcessingPipeline.java:[854,47]
cannot resolve symbol
symbol  : class CacheableProcessingComponent 
location: class org.apache.cocoon.components.pipeline.impl.AbstractCachingProcessingPipeline

/home/maven/continuum-data/working-directory/68/src/main/java/org/apache/cocoon/components/pipeline/impl/AbstractCachingProcessingPipeline.java:[883,30]
cannot resolve symbol
symbol  : class CachedResponse 
location: class org.apache.cocoon.components.pipeline.impl.AbstractCachingProcessingPipeline

/home/maven/continuum-data/working-directory/68/src/main/java/org/apache/cocoon/components/pipeline/impl/AbstractCachingProcessingPipeline.java:[883,55]
cannot resolve symbol
symbol  : class CachedResponse 
location: class org.apache.cocoon.components.pipeline.impl.AbstractCachingProcessingPipeline

/home/maven/continuum-data/working-directory/68/src/main/java/org/apache/cocoon/components/pipeline/impl/AbstractCachingProcessingPipeline.java:[995,25]
cannot resolve symbol
symbol  : class CacheableProcessingComponent 
location: class org.apache.cocoon.components.pipeline.impl.AbstractCachingProcessingPipeline

/home/maven/continuum-data/working-directory/68/src/main/java/org/apache/cocoon/components/pipeline/impl/AbstractCachingProcessingPipeline.java:[1000,25]
cannot resolve symbol
symbol  : class CacheableProcessingComponent 
location: class org.apache.cocoon.components.pipeline.impl.AbstractCachingProcessingPipeline

/home/maven/continuum-data/working-directory/68/src/main/java/org/apache/cocoon/components/pipeline/impl/AbstractCachingProcessingPipeline.java:[1004,25]
cannot resolve symbol
symbol  : class CacheableProcessingComponent 
location: class org.apache.cocoon.components.pipeline.impl.AbstractCachingProcessingPipeline

/home/maven/continuum-data/working-directory/68/src/main/java/org/apache/cocoon/xml/AttributesImpl.java:[53,55]
cannot resolve symbol
symbol  : variable AttributeTypes 
location: class org.apache.cocoon.xml.AttributesImpl

/home/maven/continuum-data/working-directory/68/src/main/java/org/apache/cocoon/xml/AttributesImpl.java:[68,54]
cannot resolve symbol
symbol  : variable AttributeTypes 
location: class org.apache.cocoon.xml.AttributesImpl

/home/maven/continuum-data/working-directory/68/src/main/java/org/apache/cocoon/xml/AttributesImpl.java:[91,52]
cannot resolve symbol
symbol  : variable AttributeTypes 
location: class org.apache.cocoon.xml.AttributesImpl

/home/maven/continuum-data/working-directory/68/src/main/java/org/apache/cocoon/xml/dom/DomHelper.java:[318,15]
incompatible types
found   : org.apache.cocoon.xml.SaxBuffer
required: org.apache.excalibur.xml.sax.XMLizable

/home/maven/continuum-data/working-directory/68/src/main/java/org/apache/cocoon/components/pipeline/impl/ExpiresCachingProcessingPipeline.java:[152,41]
cannot resolve symbol
symbol  : class CachedResponse 
location: class org.apache.cocoon.components.pipeline.impl.ExpiresCachingProcessingPipeline

/home/maven/continuum-data/working-directory/68/src/main/java/org/apache/cocoon/components/pipeline/impl/ExpiresCachingProcessingPipeline.java:[337,41]
cannot resolve symbol
symbol  : class CachedResponse 
location: class org.apache.cocoon.components.pipeline.impl.ExpiresCachingProcessingPipeline

/home/maven/continuum-data/working-directory/68/src/main/java/org/apache/cocoon/caching/impl/CacheImpl.java:[99,14]
cannot resolve symbol
symbol  : class CachedResponse 
location: class org.apache.cocoon.caching.impl.CacheImpl

/home/maven/continuum-data/working-directory/68/src/main/java/org/apache/cocoon/caching/impl/CacheImpl.java:[99,34]
cannot resolve symbol
symbol  : class CachedResponse 
location: class org.apache.cocoon.caching.impl.CacheImpl

/home/maven/continuum-data/working-directory/68/src/main/java/org/apache/cocoon/components/pipeline/impl/CachingProcessingPipeline.java:[51,12]
cannot resolve symbol
symbol  : class CachedResponse 
location: class org.apache.cocoon.components.pipeline.impl.CachingProcessingPipeline

/home/maven/continuum-data/working-directory/68/src/main/java/org/apache/cocoon/components/pipeline/impl/CachingProcessingPipeline.java:[53,31]
cannot resolve symbol
symbol  : class CachedResponse 
location: class org.apache.cocoon.components.pipeline.impl.CachingProcessingPipeline

/home/maven/continuum-data/working-directory/68/src/main/java/org/apache/cocoon/components/pipeline/impl/CachingProcessingPipeline.java:[58,31]
cannot resolve symbol
symbol  : class CachedResponse 
location: class org.apache.cocoon.components.pipeline.impl.CachingProcessingPipeline

/home/maven/continuum-data/working-directory/68/src/main/java/org/apache/cocoon/components/pipeline/impl/CachingPointProcessingPipeline.java:[177,16]
cannot resolve symbol
symbol  : class CachedResponse 
location: class org.apache.cocoon.components.pipeline.impl.CachingPointProcessingPipeline

/home/maven/continuum-data/working-directory/68/src/main/java/org/apache/cocoon/components/pipeline/impl/CachingPointProcessingPipeline.java:[177,46]
cannot resolve symbol
symbol  : class CachedResponse 
location: class org.apache.cocoon.components.pipeline.impl.CachingPointProcessingPipeline

/home/maven/continuum-data/working-directory/68/src/main/java/org/apache/cocoon/components/pipeline/impl/CachingPointProcessingPipeline.java:[206,20]
cannot resolve symbol
symbol  : class CachedResponse 
location: class org.apache.cocoon.components.pipeline.impl.CachingPointProcessingPipeline

/home/maven/continuum-data/working-directory/68/src/main/java/org/apache/cocoon/components/pipeline/impl/CachingPointProcessingPipeline.java:[206,50]
cannot resolve symbol
symbol  : class CachedResponse 
location: class org.apache.cocoon.components.pipeline.impl.CachingPointProcessingPipeline


[INFO] ------------------------------------------------------------------------
[INFO] For more information, run Maven with the -e switch
[INFO] ------------------------------------------------------------------------
[INFO] Total time: 25 seconds
[INFO] Finished at: Tue Jan 02 00:21:33 GMT 2007
[INFO] Final Memory: 7M/20M
[INFO] ------------------------------------------------------------------------

****************************************************************************



Mime
View raw message