cocoon-dev mailing list archives

Site index · List index
Message view « Date » · « Thread »
Top « Date » · « Thread »
From "Continuum@cocoon.zones.apache.org" <...@cocoon.apache.org>
Subject [continuum] BUILD FAILURE: Template framework implementation
Date Mon, 22 Jan 2007 00:20:01 GMT
Online report : http://cocoon.zones.apache.org/continuum/servlet/continuum/target/ProjectBuild.vm/view/ProjectBuild/id/18/buildId/1784
Build statistics:
  State: Failed
  Previous State: Ok
  Started at: Mon, 22 Jan 2007 00:19:29 +0000
  Finished at: Mon, 22 Jan 2007 00:20:00 +0000
  Total time: 31s
  Build Trigger: Schedule
  Exit code: 1
  Building machine hostname: cocoon.zones.apache.org
  Operating system : SunOS(unknown)
  Java version : 1.4.2_06(Sun Microsystems Inc.)

Changes
         jjohnston          Add test-scope dependency to cocoon-pipeline-impl's test jar to
fix template block's testcase compilation
             /cocoon/trunk/blocks/cocoon-template/cocoon-template-impl/pom.xml
        
****************************************************************************
Output:
****************************************************************************
[INFO] Scanning for projects...
[INFO] ----------------------------------------------------------------------------
[INFO] Building Template framework implementation
[INFO]    task-segment: [clean, install]
[INFO] ----------------------------------------------------------------------------
[INFO] [clean:clean]
[INFO] Deleting directory /home/maven/continuum-data/working-directory/18/target
[INFO] [resources:resources]
[INFO] Using default encoding to copy filtered resources.
[WARNING] 
	Artifact junit:junit:jar:3.8.2:test retains local scope 'test' overriding broader scope 'compile'
	given by a dependency. If this is not intended, modify or remove the local scope.

[INFO] [compiler:compile]
Compiling 94 source files to /home/maven/continuum-data/working-directory/18/target/classes
[INFO] [resources:testResources]
[INFO] Using default encoding to copy filtered resources.
[INFO] [compiler:testCompile]
Compiling 7 source files to /home/maven/continuum-data/working-directory/18/target/test-classes
[INFO] ------------------------------------------------------------------------
[ERROR] BUILD FAILURE
[INFO] ------------------------------------------------------------------------
[INFO] Compilation failure

/home/maven/continuum-data/working-directory/18/src/test/java/org/apache/cocoon/template/jxtg/JXTemplateGeneratorTestCase.java:[25,25]
cannot resolve symbol
symbol  : class SitemapComponentTestCase 
location: package cocoon

/home/maven/continuum-data/working-directory/18/src/test/java/org/apache/cocoon/template/jxtg/JXTemplateGeneratorTestCase.java:[32,49]
cannot resolve symbol
symbol  : class SitemapComponentTestCase 
location: class org.apache.cocoon.template.jxtg.JXTemplateGeneratorTestCase

/home/maven/continuum-data/working-directory/18/src/test/java/org/apache/cocoon/components/expression/ExpressionTestCase.java:[20,25]
cannot resolve symbol
symbol  : class CocoonTestCase 
location: package cocoon

/home/maven/continuum-data/working-directory/18/src/test/java/org/apache/cocoon/components/expression/ExpressionTestCase.java:[22,40]
cannot resolve symbol
symbol  : class CocoonTestCase 
location: class org.apache.cocoon.components.expression.ExpressionTestCase

/home/maven/continuum-data/working-directory/18/src/test/java/org/apache/cocoon/environment/FOMTestCase.java:[21,25]
cannot resolve symbol
symbol  : class SitemapComponentTestCase 
location: package cocoon

/home/maven/continuum-data/working-directory/18/src/test/java/org/apache/cocoon/environment/FOMTestCase.java:[28,33]
cannot resolve symbol
symbol  : class SitemapComponentTestCase 
location: class org.apache.cocoon.environment.FOMTestCase

/home/maven/continuum-data/working-directory/18/src/test/java/org/apache/cocoon/components/accessor/AccessorTestCase.java:[23,25]
cannot resolve symbol
symbol  : class SitemapComponentTestCase 
location: package cocoon

/home/maven/continuum-data/working-directory/18/src/test/java/org/apache/cocoon/components/accessor/AccessorTestCase.java:[29,38]
cannot resolve symbol
symbol  : class SitemapComponentTestCase 
location: class org.apache.cocoon.components.accessor.AccessorTestCase

/home/maven/continuum-data/working-directory/18/src/test/java/org/apache/cocoon/template/jxtg/JXTemplateGeneratorTestCase.java:[54,8]
cannot resolve symbol
symbol  : variable super 
location: class org.apache.cocoon.template.jxtg.JXTemplateGeneratorTestCase

/home/maven/continuum-data/working-directory/18/src/test/java/org/apache/cocoon/template/jxtg/JXTemplateGeneratorTestCase.java:[57,36]
cannot resolve symbol
symbol  : method getObjectModel ()
location: class org.apache.cocoon.template.jxtg.JXTemplateGeneratorTestCase

/home/maven/continuum-data/working-directory/18/src/test/java/org/apache/cocoon/template/jxtg/JXTemplateGeneratorTestCase.java:[67,20]
cannot resolve symbol
symbol  : method load (java.lang.String)
location: class org.apache.cocoon.template.jxtg.JXTemplateGeneratorTestCase

/home/maven/continuum-data/working-directory/18/src/test/java/org/apache/cocoon/template/jxtg/JXTemplateGeneratorTestCase.java:[67,59]
cannot resolve symbol
symbol  : variable EMPTY_PARAMS 
location: class org.apache.cocoon.template.jxtg.JXTemplateGeneratorTestCase

/home/maven/continuum-data/working-directory/18/src/test/java/org/apache/cocoon/template/jxtg/JXTemplateGeneratorTestCase.java:[74,20]
cannot resolve symbol
symbol  : method load (java.lang.String)
location: class org.apache.cocoon.template.jxtg.JXTemplateGeneratorTestCase

/home/maven/continuum-data/working-directory/18/src/test/java/org/apache/cocoon/template/jxtg/JXTemplateGeneratorTestCase.java:[74,60]
cannot resolve symbol
symbol  : variable EMPTY_PARAMS 
location: class org.apache.cocoon.template.jxtg.JXTemplateGeneratorTestCase

/home/maven/continuum-data/working-directory/18/src/test/java/org/apache/cocoon/template/jxtg/JXTemplateGeneratorTestCase.java:[84,20]
cannot resolve symbol
symbol  : method load (java.lang.String)
location: class org.apache.cocoon.template.jxtg.JXTemplateGeneratorTestCase

/home/maven/continuum-data/working-directory/18/src/test/java/org/apache/cocoon/template/jxtg/JXTemplateGeneratorTestCase.java:[84,37]
cannot resolve symbol
symbol  : method generate (java.lang.String,java.lang.String,org.apache.avalon.framework.parameters.Parameters)
location: class org.apache.cocoon.template.jxtg.JXTemplateGeneratorTestCase

/home/maven/continuum-data/working-directory/18/src/test/java/org/apache/cocoon/template/jxtg/JXTemplateGeneratorTestCase.java:[91,20]
cannot resolve symbol
symbol  : method load (java.lang.String)
location: class org.apache.cocoon.template.jxtg.JXTemplateGeneratorTestCase

/home/maven/continuum-data/working-directory/18/src/test/java/org/apache/cocoon/template/jxtg/JXTemplateGeneratorTestCase.java:[91,60]
cannot resolve symbol
symbol  : variable EMPTY_PARAMS 
location: class org.apache.cocoon.template.jxtg.JXTemplateGeneratorTestCase

/home/maven/continuum-data/working-directory/18/src/test/java/org/apache/cocoon/template/jxtg/JXTemplateGeneratorTestCase.java:[101,33]
cannot resolve symbol
symbol  : method getRequest ()
location: class org.apache.cocoon.template.jxtg.JXTemplateGeneratorTestCase

/home/maven/continuum-data/working-directory/18/src/test/java/org/apache/cocoon/template/jxtg/JXTemplateGeneratorTestCase.java:[102,20]
cannot resolve symbol
symbol  : method load (java.lang.String)
location: class org.apache.cocoon.template.jxtg.JXTemplateGeneratorTestCase

/home/maven/continuum-data/working-directory/18/src/test/java/org/apache/cocoon/template/jxtg/JXTemplateGeneratorTestCase.java:[102,37]
cannot resolve symbol
symbol  : method generate (java.lang.String,java.lang.String,org.apache.avalon.framework.parameters.Parameters)
location: class org.apache.cocoon.template.jxtg.JXTemplateGeneratorTestCase

/home/maven/continuum-data/working-directory/18/src/test/java/org/apache/cocoon/template/jxtg/JXTemplateGeneratorTestCase.java:[109,20]
cannot resolve symbol
symbol  : method load (java.lang.String)
location: class org.apache.cocoon.template.jxtg.JXTemplateGeneratorTestCase

/home/maven/continuum-data/working-directory/18/src/test/java/org/apache/cocoon/template/jxtg/JXTemplateGeneratorTestCase.java:[109,60]
cannot resolve symbol
symbol  : variable EMPTY_PARAMS 
location: class org.apache.cocoon.template.jxtg.JXTemplateGeneratorTestCase

/home/maven/continuum-data/working-directory/18/src/test/java/org/apache/cocoon/template/jxtg/JXTemplateGeneratorTestCase.java:[118,20]
cannot resolve symbol
symbol  : method load (java.lang.String)
location: class org.apache.cocoon.template.jxtg.JXTemplateGeneratorTestCase

/home/maven/continuum-data/working-directory/18/src/test/java/org/apache/cocoon/template/jxtg/JXTemplateGeneratorTestCase.java:[118,60]
cannot resolve symbol
symbol  : variable EMPTY_PARAMS 
location: class org.apache.cocoon.template.jxtg.JXTemplateGeneratorTestCase

/home/maven/continuum-data/working-directory/18/src/test/java/org/apache/cocoon/template/jxtg/JXTemplateGeneratorTestCase.java:[126,20]
cannot resolve symbol
symbol  : method load (java.lang.String)
location: class org.apache.cocoon.template.jxtg.JXTemplateGeneratorTestCase

/home/maven/continuum-data/working-directory/18/src/test/java/org/apache/cocoon/template/jxtg/JXTemplateGeneratorTestCase.java:[126,60]
cannot resolve symbol
symbol  : variable EMPTY_PARAMS 
location: class org.apache.cocoon.template.jxtg.JXTemplateGeneratorTestCase

/home/maven/continuum-data/working-directory/18/src/test/java/org/apache/cocoon/template/jxtg/JXTemplateGeneratorTestCase.java:[133,20]
cannot resolve symbol
symbol  : method load (java.lang.String)
location: class org.apache.cocoon.template.jxtg.JXTemplateGeneratorTestCase

/home/maven/continuum-data/working-directory/18/src/test/java/org/apache/cocoon/template/jxtg/JXTemplateGeneratorTestCase.java:[133,60]
cannot resolve symbol
symbol  : variable EMPTY_PARAMS 
location: class org.apache.cocoon.template.jxtg.JXTemplateGeneratorTestCase

/home/maven/continuum-data/working-directory/18/src/test/java/org/apache/cocoon/template/jxtg/JXTemplateGeneratorTestCase.java:[140,20]
cannot resolve symbol
symbol  : method load (java.lang.String)
location: class org.apache.cocoon.template.jxtg.JXTemplateGeneratorTestCase

/home/maven/continuum-data/working-directory/18/src/test/java/org/apache/cocoon/template/jxtg/JXTemplateGeneratorTestCase.java:[140,60]
cannot resolve symbol
symbol  : variable EMPTY_PARAMS 
location: class org.apache.cocoon.template.jxtg.JXTemplateGeneratorTestCase

/home/maven/continuum-data/working-directory/18/src/test/java/org/apache/cocoon/template/jxtg/JXTemplateGeneratorTestCase.java:[149,20]
cannot resolve symbol
symbol  : method load (java.lang.String)
location: class org.apache.cocoon.template.jxtg.JXTemplateGeneratorTestCase

/home/maven/continuum-data/working-directory/18/src/test/java/org/apache/cocoon/template/jxtg/JXTemplateGeneratorTestCase.java:[149,60]
cannot resolve symbol
symbol  : variable EMPTY_PARAMS 
location: class org.apache.cocoon.template.jxtg.JXTemplateGeneratorTestCase

/home/maven/continuum-data/working-directory/18/src/test/java/org/apache/cocoon/template/jxtg/JXTemplateGeneratorTestCase.java:[158,20]
cannot resolve symbol
symbol  : method load (java.lang.String)
location: class org.apache.cocoon.template.jxtg.JXTemplateGeneratorTestCase

/home/maven/continuum-data/working-directory/18/src/test/java/org/apache/cocoon/template/jxtg/JXTemplateGeneratorTestCase.java:[158,60]
cannot resolve symbol
symbol  : variable EMPTY_PARAMS 
location: class org.apache.cocoon.template.jxtg.JXTemplateGeneratorTestCase

/home/maven/continuum-data/working-directory/18/src/test/java/org/apache/cocoon/template/jxtg/JXTemplateGeneratorTestCase.java:[166,20]
cannot resolve symbol
symbol  : method load (java.lang.String)
location: class org.apache.cocoon.template.jxtg.JXTemplateGeneratorTestCase

/home/maven/continuum-data/working-directory/18/src/test/java/org/apache/cocoon/template/jxtg/JXTemplateGeneratorTestCase.java:[166,60]
cannot resolve symbol
symbol  : variable EMPTY_PARAMS 
location: class org.apache.cocoon.template.jxtg.JXTemplateGeneratorTestCase

/home/maven/continuum-data/working-directory/18/src/test/java/org/apache/cocoon/template/jxtg/JXTemplateGeneratorTestCase.java:[176,41]
cannot resolve symbol
symbol  : method load (java.lang.String)
location: class org.apache.cocoon.template.jxtg.JXTemplateGeneratorTestCase

/home/maven/continuum-data/working-directory/18/src/test/java/org/apache/cocoon/template/jxtg/JXTemplateGeneratorTestCase.java:[177,20]
cannot resolve symbol
symbol  : method load (java.lang.String)
location: class org.apache.cocoon.template.jxtg.JXTemplateGeneratorTestCase

/home/maven/continuum-data/working-directory/18/src/test/java/org/apache/cocoon/template/jxtg/JXTemplateGeneratorTestCase.java:[177,60]
cannot resolve symbol
symbol  : variable EMPTY_PARAMS 
location: class org.apache.cocoon.template.jxtg.JXTemplateGeneratorTestCase

/home/maven/continuum-data/working-directory/18/src/test/java/org/apache/cocoon/components/expression/ExpressionTestCase.java:[32,8]
cannot resolve symbol
symbol  : method assertEquals (java.lang.String,java.lang.Object)
location: class org.apache.cocoon.components.expression.ExpressionTestCase

/home/maven/continuum-data/working-directory/18/src/test/java/org/apache/cocoon/components/expression/ExpressionTestCase.java:[33,8]
cannot resolve symbol
symbol  : method assertEquals (java.lang.String,java.lang.Object)
location: class org.apache.cocoon.components.expression.ExpressionTestCase

/home/maven/continuum-data/working-directory/18/src/test/java/org/apache/cocoon/components/expression/ExpressionTestCase.java:[34,8]
cannot resolve symbol
symbol  : method assertEquals (java.lang.String,java.lang.Object)
location: class org.apache.cocoon.components.expression.ExpressionTestCase

/home/maven/continuum-data/working-directory/18/src/test/java/org/apache/cocoon/components/expression/ExpressionTestCase.java:[35,8]
cannot resolve symbol
symbol  : method assertEquals (java.lang.String,java.lang.Object)
location: class org.apache.cocoon.components.expression.ExpressionTestCase

/home/maven/continuum-data/working-directory/18/src/test/java/org/apache/cocoon/components/expression/ExpressionTestCase.java:[45,8]
cannot resolve symbol
symbol  : method assertEquals (java.lang.String,java.lang.Object)
location: class org.apache.cocoon.components.expression.ExpressionTestCase

/home/maven/continuum-data/working-directory/18/src/test/java/org/apache/cocoon/components/expression/ExpressionTestCase.java:[46,8]
cannot resolve symbol
symbol  : method assertEquals (java.lang.String,java.lang.Object)
location: class org.apache.cocoon.components.expression.ExpressionTestCase

/home/maven/continuum-data/working-directory/18/src/test/java/org/apache/cocoon/components/expression/ExpressionTestCase.java:[50,55]
cannot resolve symbol
symbol  : method lookup (java.lang.String)
location: class org.apache.cocoon.components.expression.ExpressionTestCase

/home/maven/continuum-data/working-directory/18/src/test/java/org/apache/cocoon/components/expression/ExpressionTestCase.java:[51,8]
cannot resolve symbol
symbol  : method assertNotNull (java.lang.String,org.apache.cocoon.components.expression.ExpressionFactory)
location: class org.apache.cocoon.components.expression.ExpressionTestCase

/home/maven/continuum-data/working-directory/18/src/test/java/org/apache/cocoon/components/expression/ExpressionTestCase.java:[54,8]
cannot resolve symbol
symbol  : method assertNotNull (java.lang.String,org.apache.cocoon.components.expression.Expression)
location: class org.apache.cocoon.components.expression.ExpressionTestCase

/home/maven/continuum-data/working-directory/18/src/test/java/org/apache/cocoon/components/expression/ExpressionTestCase.java:[56,8]
cannot resolve symbol
symbol  : method assertEquals (java.lang.Long,java.lang.Object)
location: class org.apache.cocoon.components.expression.ExpressionTestCase

/home/maven/continuum-data/working-directory/18/src/test/java/org/apache/cocoon/components/expression/ExpressionTestCase.java:[57,8]
cannot resolve symbol
symbol  : method release (org.apache.cocoon.components.expression.ExpressionFactory)
location: class org.apache.cocoon.components.expression.ExpressionTestCase

/home/maven/continuum-data/working-directory/18/src/test/java/org/apache/cocoon/components/expression/ExpressionTestCase.java:[61,55]
cannot resolve symbol
symbol  : method lookup (java.lang.String)
location: class org.apache.cocoon.components.expression.ExpressionTestCase

/home/maven/continuum-data/working-directory/18/src/test/java/org/apache/cocoon/components/expression/ExpressionTestCase.java:[62,8]
cannot resolve symbol
symbol  : method assertNotNull (java.lang.String,org.apache.cocoon.components.expression.ExpressionFactory)
location: class org.apache.cocoon.components.expression.ExpressionTestCase

/home/maven/continuum-data/working-directory/18/src/test/java/org/apache/cocoon/components/expression/ExpressionTestCase.java:[65,8]
cannot resolve symbol
symbol  : method assertNotNull (java.lang.String,org.apache.cocoon.components.expression.Expression)
location: class org.apache.cocoon.components.expression.ExpressionTestCase

/home/maven/continuum-data/working-directory/18/src/test/java/org/apache/cocoon/components/expression/ExpressionTestCase.java:[67,8]
cannot resolve symbol
symbol  : method assertEquals (java.lang.Double,java.lang.Object)
location: class org.apache.cocoon.components.expression.ExpressionTestCase

/home/maven/continuum-data/working-directory/18/src/test/java/org/apache/cocoon/components/expression/ExpressionTestCase.java:[68,8]
cannot resolve symbol
symbol  : method release (org.apache.cocoon.components.expression.ExpressionFactory)
location: class org.apache.cocoon.components.expression.ExpressionTestCase

/home/maven/continuum-data/working-directory/18/src/test/java/org/apache/cocoon/components/expression/ExpressionTestCase.java:[72,55]
cannot resolve symbol
symbol  : method lookup (java.lang.String)
location: class org.apache.cocoon.components.expression.ExpressionTestCase

/home/maven/continuum-data/working-directory/18/src/test/java/org/apache/cocoon/components/expression/ExpressionTestCase.java:[73,8]
cannot resolve symbol
symbol  : method assertNotNull (java.lang.String,org.apache.cocoon.components.expression.ExpressionFactory)
location: class org.apache.cocoon.components.expression.ExpressionTestCase

/home/maven/continuum-data/working-directory/18/src/test/java/org/apache/cocoon/components/expression/ExpressionTestCase.java:[76,8]
cannot resolve symbol
symbol  : method assertNotNull (java.lang.String,org.apache.cocoon.components.expression.Expression)
location: class org.apache.cocoon.components.expression.ExpressionTestCase

/home/maven/continuum-data/working-directory/18/src/test/java/org/apache/cocoon/components/expression/ExpressionTestCase.java:[77,8]
cannot resolve symbol
symbol  : method assertEquals (java.lang.Double,java.lang.Object)
location: class org.apache.cocoon.components.expression.ExpressionTestCase

/home/maven/continuum-data/working-directory/18/src/test/java/org/apache/cocoon/components/expression/ExpressionTestCase.java:[80,8]
cannot resolve symbol
symbol  : method assertNotNull (java.lang.String,org.apache.cocoon.components.expression.Expression)
location: class org.apache.cocoon.components.expression.ExpressionTestCase

/home/maven/continuum-data/working-directory/18/src/test/java/org/apache/cocoon/components/expression/ExpressionTestCase.java:[81,8]
cannot resolve symbol
symbol  : method assertEquals (java.lang.Long,java.lang.Object)
location: class org.apache.cocoon.components.expression.ExpressionTestCase

/home/maven/continuum-data/working-directory/18/src/test/java/org/apache/cocoon/components/expression/ExpressionTestCase.java:[84,8]
cannot resolve symbol
symbol  : method assertNotNull (java.lang.String,org.apache.cocoon.components.expression.Expression)
location: class org.apache.cocoon.components.expression.ExpressionTestCase

/home/maven/continuum-data/working-directory/18/src/test/java/org/apache/cocoon/components/expression/ExpressionTestCase.java:[85,8]
cannot resolve symbol
symbol  : method assertEquals (java.lang.Double,java.lang.Object)
location: class org.apache.cocoon.components.expression.ExpressionTestCase

/home/maven/continuum-data/working-directory/18/src/test/java/org/apache/cocoon/components/expression/ExpressionTestCase.java:[87,8]
cannot resolve symbol
symbol  : method release (org.apache.cocoon.components.expression.ExpressionFactory)
location: class org.apache.cocoon.components.expression.ExpressionTestCase

/home/maven/continuum-data/working-directory/18/src/test/java/org/apache/cocoon/environment/FOMTestCase.java:[31,55]
cannot resolve symbol
symbol  : method lookup (java.lang.String)
location: class org.apache.cocoon.environment.FOMTestCase

/home/maven/continuum-data/working-directory/18/src/test/java/org/apache/cocoon/environment/FOMTestCase.java:[35,58]
cannot resolve symbol
symbol  : method getObjectModel ()
location: class org.apache.cocoon.environment.FOMTestCase

/home/maven/continuum-data/working-directory/18/src/test/java/org/apache/cocoon/environment/FOMTestCase.java:[38,8]
cannot resolve symbol
symbol  : method assertEquals (java.lang.String,java.lang.Object)
location: class org.apache.cocoon.environment.FOMTestCase

/home/maven/continuum-data/working-directory/18/src/test/java/org/apache/cocoon/environment/FOMTestCase.java:[41,8]
cannot resolve symbol
symbol  : method assertEquals (java.lang.String,java.lang.Object)
location: class org.apache.cocoon.environment.FOMTestCase

/home/maven/continuum-data/working-directory/18/src/test/java/org/apache/cocoon/environment/FOMTestCase.java:[42,8]
cannot resolve symbol
symbol  : method release (org.apache.cocoon.components.expression.ExpressionFactory)
location: class org.apache.cocoon.environment.FOMTestCase

/home/maven/continuum-data/working-directory/18/src/test/java/org/apache/cocoon/environment/FOMTestCase.java:[46,55]
cannot resolve symbol
symbol  : method lookup (java.lang.String)
location: class org.apache.cocoon.environment.FOMTestCase

/home/maven/continuum-data/working-directory/18/src/test/java/org/apache/cocoon/environment/FOMTestCase.java:[50,58]
cannot resolve symbol
symbol  : method getObjectModel ()
location: class org.apache.cocoon.environment.FOMTestCase

/home/maven/continuum-data/working-directory/18/src/test/java/org/apache/cocoon/environment/FOMTestCase.java:[53,8]
cannot resolve symbol
symbol  : method assertEquals (java.lang.String,java.lang.Object)
location: class org.apache.cocoon.environment.FOMTestCase

/home/maven/continuum-data/working-directory/18/src/test/java/org/apache/cocoon/environment/FOMTestCase.java:[56,8]
cannot resolve symbol
symbol  : method assertEquals (java.lang.String,java.lang.Object)
location: class org.apache.cocoon.environment.FOMTestCase

/home/maven/continuum-data/working-directory/18/src/test/java/org/apache/cocoon/environment/FOMTestCase.java:[57,8]
cannot resolve symbol
symbol  : method release (org.apache.cocoon.components.expression.ExpressionFactory)
location: class org.apache.cocoon.environment.FOMTestCase

/home/maven/continuum-data/working-directory/18/src/test/java/org/apache/cocoon/components/accessor/AccessorTestCase.java:[33,29]
cannot resolve symbol
symbol  : method lookup (java.lang.String)
location: class org.apache.cocoon.components.accessor.AccessorTestCase

/home/maven/continuum-data/working-directory/18/src/test/java/org/apache/cocoon/components/accessor/AccessorTestCase.java:[36,8]
cannot resolve symbol
symbol  : method assertEquals (java.lang.String,java.lang.String)
location: class org.apache.cocoon.components.accessor.AccessorTestCase

/home/maven/continuum-data/working-directory/18/src/test/java/org/apache/cocoon/components/accessor/AccessorTestCase.java:[38,8]
cannot resolve symbol
symbol  : method release (org.apache.avalon.framework.service.ServiceSelector)
location: class org.apache.cocoon.components.accessor.AccessorTestCase

/home/maven/continuum-data/working-directory/18/src/test/java/org/apache/cocoon/components/accessor/AccessorTestCase.java:[43,8]
cannot resolve symbol
symbol  : method getRequest ()
location: class org.apache.cocoon.components.accessor.AccessorTestCase

/home/maven/continuum-data/working-directory/18/src/test/java/org/apache/cocoon/components/accessor/AccessorTestCase.java:[45,29]
cannot resolve symbol
symbol  : method lookup (java.lang.String)
location: class org.apache.cocoon.components.accessor.AccessorTestCase

/home/maven/continuum-data/working-directory/18/src/test/java/org/apache/cocoon/components/accessor/AccessorTestCase.java:[48,8]
cannot resolve symbol
symbol  : method assertEquals (java.lang.String,java.lang.String)
location: class org.apache.cocoon.components.accessor.AccessorTestCase

/home/maven/continuum-data/working-directory/18/src/test/java/org/apache/cocoon/components/accessor/AccessorTestCase.java:[50,8]
cannot resolve symbol
symbol  : method release (org.apache.avalon.framework.service.ServiceSelector)
location: class org.apache.cocoon.components.accessor.AccessorTestCase

/home/maven/continuum-data/working-directory/18/src/test/java/org/apache/cocoon/components/accessor/AccessorTestCase.java:[54,8]
cannot resolve symbol
symbol  : method getContext ()
location: class org.apache.cocoon.components.accessor.AccessorTestCase

/home/maven/continuum-data/working-directory/18/src/test/java/org/apache/cocoon/components/accessor/AccessorTestCase.java:[56,29]
cannot resolve symbol
symbol  : method lookup (java.lang.String)
location: class org.apache.cocoon.components.accessor.AccessorTestCase

/home/maven/continuum-data/working-directory/18/src/test/java/org/apache/cocoon/components/accessor/AccessorTestCase.java:[59,8]
cannot resolve symbol
symbol  : method assertEquals (java.lang.String,java.lang.Object)
location: class org.apache.cocoon.components.accessor.AccessorTestCase

/home/maven/continuum-data/working-directory/18/src/test/java/org/apache/cocoon/components/accessor/AccessorTestCase.java:[61,8]
cannot resolve symbol
symbol  : method release (org.apache.avalon.framework.service.ServiceSelector)
location: class org.apache.cocoon.components.accessor.AccessorTestCase

/home/maven/continuum-data/working-directory/18/src/test/java/org/apache/cocoon/components/accessor/AccessorTestCase.java:[66,8]
cannot resolve symbol
symbol  : method getRequest ()
location: class org.apache.cocoon.components.accessor.AccessorTestCase

/home/maven/continuum-data/working-directory/18/src/test/java/org/apache/cocoon/components/accessor/AccessorTestCase.java:[67,8]
cannot resolve symbol
symbol  : method getContext ()
location: class org.apache.cocoon.components.accessor.AccessorTestCase

/home/maven/continuum-data/working-directory/18/src/test/java/org/apache/cocoon/components/accessor/AccessorTestCase.java:[69,29]
cannot resolve symbol
symbol  : method lookup (java.lang.String)
location: class org.apache.cocoon.components.accessor.AccessorTestCase

/home/maven/continuum-data/working-directory/18/src/test/java/org/apache/cocoon/components/accessor/AccessorTestCase.java:[72,8]
cannot resolve symbol
symbol  : method assertEquals (java.lang.String,java.lang.String)
location: class org.apache.cocoon.components.accessor.AccessorTestCase

/home/maven/continuum-data/working-directory/18/src/test/java/org/apache/cocoon/components/accessor/AccessorTestCase.java:[73,8]
cannot resolve symbol
symbol  : method assertEquals (java.lang.String,java.lang.String)
location: class org.apache.cocoon.components.accessor.AccessorTestCase

/home/maven/continuum-data/working-directory/18/src/test/java/org/apache/cocoon/components/accessor/AccessorTestCase.java:[74,8]
cannot resolve symbol
symbol  : method assertEquals (java.lang.String,java.lang.Object)
location: class org.apache.cocoon.components.accessor.AccessorTestCase

/home/maven/continuum-data/working-directory/18/src/test/java/org/apache/cocoon/components/accessor/AccessorTestCase.java:[76,8]
cannot resolve symbol
symbol  : method release (org.apache.avalon.framework.service.ServiceSelector)
location: class org.apache.cocoon.components.accessor.AccessorTestCase


[INFO] ------------------------------------------------------------------------
[INFO] For more information, run Maven with the -e switch
[INFO] ------------------------------------------------------------------------
[INFO] Total time: 29 seconds
[INFO] Finished at: Mon Jan 22 00:20:00 GMT+00:00 2007
[INFO] Final Memory: 10M/23M
[INFO] ------------------------------------------------------------------------

****************************************************************************



Mime
View raw message