cocoon-dev mailing list archives

Site index · List index
Message view « Date » · « Thread »
Top « Date » · « Thread »
From "Continuum@cocoon.zones.apache.org" <...@cocoon.apache.org>
Subject [continuum] BUILD FAILURE: Cocoon Configuration Implementation
Date Sun, 24 Dec 2006 11:28:05 GMT
Online report : http://cocoon.zones.apache.org:12000/continuum/servlet/continuum/target/ProjectBuild.vm/view/ProjectBuild/id/61/buildId/1213
Build statistics:
  State: Failed
  Previous Build: No previous build.
  Started at: Sun, 24 Dec 2006 11:28:00 +0000
  Finished at: Sun, 24 Dec 2006 11:28:05 +0000
  Total time: 4s
  Build Trigger: Forced
  Exit code: 1
  Building machine hostname: cocoon.zones.apache.org
  Operating system : SunOS(unknown)
  Java version : 1.4.2_06(Sun Microsystems Inc.)

Changes
                            src/main/java/org/apache/cocoon/configuration/impl/DeploymentUtil.java
        
****************************************************************************
Output:
****************************************************************************
[INFO] Scanning for projects...
[INFO] ----------------------------------------------------------------------------
[INFO] Building Cocoon Configuration Implementation
[INFO]    task-segment: [clean, install]
[INFO] ----------------------------------------------------------------------------
[INFO] [clean:clean]
[INFO] [resources:resources]
[INFO] Using default encoding to copy filtered resources.
[INFO] snapshot org.apache.cocoon:cocoon-configuration-api:1.0.0-SNAPSHOT: checking for updates
from apache.snapshot
[INFO] snapshot org.apache.cocoon:cocoon-configuration-api:1.0.0-SNAPSHOT: checking for updates
from apache-cvs
[INFO] snapshot org.apache.cocoon:cocoon-configuration-api:1.0.0-SNAPSHOT: checking for updates
from apache.snapshots
[INFO] [compiler:compile]
Compiling 4 source files to /home/maven/continuum-data/working-directory/61/target/classes
[INFO] ------------------------------------------------------------------------
[ERROR] BUILD FAILURE
[INFO] ------------------------------------------------------------------------
[INFO] Compilation failure

/home/maven/continuum-data/working-directory/61/src/main/java/org/apache/cocoon/configuration/impl/DeploymentUtil.java:[32,29]
package org.apache.commons.io does not exist

/home/maven/continuum-data/working-directory/61/src/main/java/org/apache/cocoon/configuration/impl/DeploymentUtil.java:[33,34]
package org.apache.commons.logging does not exist

/home/maven/continuum-data/working-directory/61/src/main/java/org/apache/cocoon/configuration/impl/DeploymentUtil.java:[34,34]
package org.apache.commons.logging does not exist

/home/maven/continuum-data/working-directory/61/src/main/java/org/apache/cocoon/configuration/impl/DeploymentUtil.java:[44,27]
cannot resolve symbol
symbol  : class Log 
location: class org.apache.cocoon.configuration.impl.DeploymentUtil

/home/maven/continuum-data/working-directory/61/src/main/java/org/apache/cocoon/configuration/impl/DeploymentUtil.java:[44,40]
cannot resolve symbol
symbol  : variable LogFactory 
location: class org.apache.cocoon.configuration.impl.DeploymentUtil

/home/maven/continuum-data/working-directory/61/src/main/java/org/apache/cocoon/configuration/impl/DeploymentUtil.java:[73,16]
cannot resolve symbol
symbol  : variable IOUtils 
location: class org.apache.cocoon.configuration.impl.DeploymentUtil


[INFO] ------------------------------------------------------------------------
[INFO] For more information, run Maven with the -e switch
[INFO] ------------------------------------------------------------------------
[INFO] Total time: 3 seconds
[INFO] Finished at: Sun Dec 24 11:28:04 GMT 2006
[INFO] Final Memory: 6M/11M
[INFO] ------------------------------------------------------------------------

****************************************************************************



Mime
View raw message