cocoon-dev mailing list archives

Site index · List index
Message view « Date » · « Thread »
Top « Date » · « Thread »
From "Continuum@cocoon.zones.apache.org" <...@cocoon.apache.org>
Subject [continuum] BUILD FAILURE: Cocoon Core
Date Thu, 02 Nov 2006 00:31:31 GMT
Online report : http://cocoon.zones.apache.org:12000/continuum/servlet/continuum/target/ProjectBuild.vm/view/ProjectBuild/id/31/buildId/380
Build statistics:
  State: Failed
  Previous State: Ok
  Started at: Thu, 2 Nov 2006 00:30:27 +0000
  Finished at: Thu, 2 Nov 2006 00:31:31 +0000
  Total time: 1m 4s
  Build Trigger: Schedule
  Exit code: 1
  Building machine hostname: cocoon.zones.apache.org
  Operating system : SunOS(unknown)
  Java version : 1.4.2_06(Sun Microsystems Inc.)

Changes
         tcurdt          committed work from Maurizio Pillitu to restore javaflow and class
reloading functionality (hurray!!),
introduced two SNAPSHOT dependencies that are in NO repository yet!!! (to compile you need
to compile jci and javaflow trunk ...will try to fix that soon ...or whoever has more time
to fix that),
commented out the fop block as it just does not compile like that ...whoever fixes the dependency
problem feel free to enable it again but after 1, 2, 3... dependency problems I did not want
to dig into this also. Grrr.



             /cocoon/trunk/blocks/cocoon-core-sample/cocoon-core-main-sample/src/main/resources/COB-INF/samples.xml
            /cocoon/trunk/blocks/cocoon-javaflow/cocoon-javaflow-impl/pom.xml
            /cocoon/trunk/blocks/cocoon-javaflow/cocoon-javaflow-sample/pom.xml
            /cocoon/trunk/blocks/cocoon-javaflow/cocoon-javaflow-sample/src/main/java/org/apache/cocoon/samples/flow/java/CalculatorFlow.java
            /cocoon/trunk/blocks/cocoon-javaflow/cocoon-javaflow-sample/src/main/resources/COB-INF/forms/employee-template.xml
            /cocoon/trunk/blocks/cocoon-javaflow/cocoon-javaflow-sample/src/main/resources/COB-INF/forms/form1-template.xml
            /cocoon/trunk/blocks/cocoon-javaflow/cocoon-javaflow-sample/src/main/resources/COB-INF/forms/form2-template.xml
            /cocoon/trunk/blocks/cocoon-javaflow/cocoon-javaflow-sample/src/main/resources/COB-INF/screens/calculator-a.xml
            /cocoon/trunk/blocks/cocoon-javaflow/cocoon-javaflow-sample/src/main/resources/COB-INF/screens/calculator-b.xml
            /cocoon/trunk/blocks/cocoon-javaflow/cocoon-javaflow-sample/src/main/resources/COB-INF/screens/calculator-operator.xml
            /cocoon/trunk/blocks/cocoon-javaflow/cocoon-javaflow-sample/src/main/resources/COB-INF/sitemap.xmap
            /cocoon/trunk/blocks/pom.xml
            /cocoon/trunk/core/cocoon-bootstrap/pom.xml
            /cocoon/trunk/core/cocoon-bootstrap/src/main/java/org/apache/cocoon/classloader/ClassLoaderConfiguration.java
            /cocoon/trunk/core/cocoon-bootstrap/src/main/java/org/apache/cocoon/classloader/ReloadingClassLoaderFactory.java
            /cocoon/trunk/core/cocoon-core/src/main/java/org/apache/cocoon/components/fam/SitemapMonitor.java
            /cocoon/trunk/core/cocoon-core/src/main/java/org/apache/cocoon/components/fam/SitemapMonitorImpl.java
            /cocoon/trunk/core/cocoon-core/src/main/java/org/apache/cocoon/components/treeprocessor/TreeProcessor.java
            /cocoon/trunk/core/cocoon-core/src/main/java/org/apache/cocoon/components/treeprocessor/sitemap/SitemapLanguage.java
            /cocoon/trunk/core/cocoon-core/src/main/java/org/apache/cocoon/core/container/spring/CocoonWebApplicationContext.java
            /cocoon/trunk/core/cocoon-core/src/main/java/org/apache/cocoon/core/container/spring/avalon/AvalonUtils.java
            /cocoon/trunk/core/cocoon-core/src/main/java/org/apache/cocoon/core/container/spring/avalon/SitemapHelper.java
            /cocoon/trunk/core/cocoon-core/src/main/resources/org/apache/cocoon/cocoon.roles
            /cocoon/trunk/core/cocoon-webapp/pom.xml
        
****************************************************************************
Output:
****************************************************************************
[INFO] Scanning for projects...
[INFO] ----------------------------------------------------------------------------
[INFO] Building Cocoon Core
[INFO]    task-segment: [clean, install]
[INFO] ----------------------------------------------------------------------------
[INFO] snapshot org.daisycms:daisy-maven-plugin:1.0.0-SNAPSHOT: checking for updates from
reinhard-m2-snapshot-repository
[INFO] snapshot org.daisycms:daisy-maven-plugin:1.0.0-SNAPSHOT: checking for updates from
apache.snapshot
[INFO] snapshot org.daisycms:daisy-maven-plugin:1.0.0-SNAPSHOT: checking for updates from
apache-cvs
[INFO] snapshot org.daisycms:daisy-maven-plugin:1.0.0-SNAPSHOT: checking for updates from
apache.snapshots
[INFO] snapshot org.daisycms:daisy-client-apps:1-SNAPSHOT: checking for updates from reinhard-m2-snapshot-repository
[INFO] snapshot org.daisycms:daisy-client-apps:1-SNAPSHOT: checking for updates from apache.snapshot
[INFO] snapshot org.daisycms:daisy-client-apps:1-SNAPSHOT: checking for updates from apache-cvs
[INFO] snapshot org.daisycms:daisy-client-apps:1-SNAPSHOT: checking for updates from apache.snapshots
[INFO] [clean:clean]
[INFO] Deleting directory /home/maven/continuum-data/working-directory/31/target
[INFO] [resources:resources]
[INFO] Using default encoding to copy filtered resources.
[INFO] snapshot org.apache.cocoon:cocoon-bootstrap:1.0.0-M2-SNAPSHOT: checking for updates
from apache.snapshot
[INFO] snapshot org.apache.cocoon:cocoon-bootstrap:1.0.0-M2-SNAPSHOT: checking for updates
from apache-cvs
[INFO] snapshot org.apache.cocoon:cocoon-bootstrap:1.0.0-M2-SNAPSHOT: checking for updates
from apache.snapshots
[WARNING] 
	Artifact junit:junit:jar:3.8.2:test retains local scope 'test' overriding broader scope 'compile'
	given by a dependency. If this is not intended, modify or remove the local scope.

[INFO] [compiler:compile]
Compiling 630 source files to /home/maven/continuum-data/working-directory/31/target/classes
[INFO] ------------------------------------------------------------------------
[ERROR] BUILD FAILURE
[INFO] ------------------------------------------------------------------------
[INFO] Compilation failure

/home/maven/continuum-data/working-directory/31/src/main/java/org/apache/cocoon/core/container/spring/avalon/SitemapHelper.java:[30,41]
package org.apache.cocoon.classloader.fam does not exist

/home/maven/continuum-data/working-directory/31/src/main/java/org/apache/cocoon/core/container/spring/avalon/SitemapHelper.java:[145,44]
cannot resolve symbol
symbol  : class SitemapMonitor 
location: class org.apache.cocoon.core.container.spring.avalon.SitemapHelper

/home/maven/continuum-data/working-directory/31/src/main/java/org/apache/cocoon/core/container/spring/avalon/SitemapHelper.java:[191,51]
cannot resolve symbol
symbol  : class SitemapMonitor 
location: class org.apache.cocoon.core.container.spring.avalon.SitemapHelper

/home/maven/continuum-data/working-directory/31/src/main/java/org/apache/cocoon/components/treeprocessor/sitemap/SitemapLanguage.java:[48,41]
package org.apache.cocoon.classloader.fam does not exist

/home/maven/continuum-data/working-directory/31/src/main/java/org/apache/cocoon/components/fam/SitemapMonitorImpl.java:[25,37]
cannot resolve symbol
symbol  : class SitemapNotifierStore 
location: package classloader

/home/maven/continuum-data/working-directory/31/src/main/java/org/apache/cocoon/components/fam/SitemapMonitorImpl.java:[26,41]
package org.apache.cocoon.classloader.fam does not exist

/home/maven/continuum-data/working-directory/31/src/main/java/org/apache/cocoon/components/fam/SitemapMonitorImpl.java:[37,15]
cannot resolve symbol
symbol  : class SitemapMonitor 
location: class org.apache.cocoon.components.fam.SitemapMonitorImpl

/home/maven/continuum-data/working-directory/31/src/main/java/org/apache/cocoon/components/treeprocessor/sitemap/SitemapLanguage.java:[338,14]
cannot resolve symbol
symbol  : class SitemapMonitor 
location: class org.apache.cocoon.components.treeprocessor.sitemap.SitemapLanguage

/home/maven/continuum-data/working-directory/31/src/main/java/org/apache/cocoon/components/treeprocessor/sitemap/SitemapLanguage.java:[338,36]
cannot resolve symbol
symbol  : class SitemapMonitor 
location: class org.apache.cocoon.components.treeprocessor.sitemap.SitemapLanguage

/home/maven/continuum-data/working-directory/31/src/main/java/org/apache/cocoon/components/treeprocessor/sitemap/SitemapLanguage.java:[338,72]
cannot resolve symbol
symbol  : variable SitemapMonitor 
location: class org.apache.cocoon.components.treeprocessor.sitemap.SitemapLanguage

/home/maven/continuum-data/working-directory/31/src/main/java/org/apache/cocoon/core/container/spring/avalon/AvalonUtils.java:[152,22]
cannot resolve symbol
symbol  : method addStore (java.lang.String,org.apache.commons.jci.stores.ResourceStore)
location: class org.apache.cocoon.classloader.ClassLoaderConfiguration

/home/maven/continuum-data/working-directory/31/src/main/java/org/apache/cocoon/components/fam/SitemapMonitorImpl.java:[65,84]
cannot resolve symbol
symbol  : class SitemapNotifierStore 
location: class org.apache.cocoon.components.fam.SitemapMonitorImpl

/home/maven/continuum-data/working-directory/31/src/main/java/org/apache/cocoon/components/fam/SitemapMonitorImpl.java:[73,87]
cannot resolve symbol
symbol  : class SitemapNotifierStore 
location: class org.apache.cocoon.components.fam.SitemapMonitorImpl


[INFO] ------------------------------------------------------------------------
[INFO] For more information, run Maven with the -e switch
[INFO] ------------------------------------------------------------------------
[INFO] Total time: 1 minute 3 seconds
[INFO] Finished at: Thu Nov 02 00:31:31 GMT 2006
[INFO] Final Memory: 7M/49M
[INFO] ------------------------------------------------------------------------

****************************************************************************



Mime
View raw message