cocoon-dev mailing list archives

Site index · List index
Message view « Date » · « Thread »
Top « Date » · « Thread »
From "continuum@cocoon.zones.apache.org" <contin...@cocoon.zones.apache.org>
Subject [continuum] BUILD FAILURE: Template framework implementation
Date Fri, 23 Jun 2006 03:10:51 GMT
Online report : http://cocoon.zones.apache.org:12000/continuum/servlet/continuum/target/ProjectBuild.vm/view/ProjectBuild/id/137/buildId/1490
Build statistics:
  State: Failed
  Previous State: Ok
  Started at: Fri, 23 Jun 2006 03:10:25 +0000
  Finished at: Fri, 23 Jun 2006 03:10:51 +0000
  Total time: 25s
  Build Trigger: Schedule
  Exit code: 1
  Building machine hostname: cocoon.zones.apache.org
  Operating system : SunOS(unknown)
  Java version : 1.4.2_06(Sun Microsystems Inc.)

Changes
         cziegeler          Fix typo and tab
             /cocoon/trunk/blocks/cocoon-template/cocoon-template-impl/src/main/java/org/apache/cocoon/components/accessor/Accessor.java
            /cocoon/trunk/blocks/cocoon-template/cocoon-template-impl/src/main/java/org/apache/cocoon/components/accessor/FlowAttributeAccessor.java
           cziegeler          Move javascript related stuff out of the TemplateObjectModelHelper
             /cocoon/trunk/blocks/cocoon-template/cocoon-template-impl/src/main/java/org/apache/cocoon/components/expression/javascript/JavaScriptExpression.java
            /cocoon/trunk/blocks/cocoon-template/cocoon-template-impl/src/main/java/org/apache/cocoon/template/environment/FlowObjectModelHelper.java
            /cocoon/trunk/core/cocoon-core/src/main/java/org/apache/cocoon/environment/TemplateObjectModelHelper.java
           cziegeler          Move javascript related stuff out of the TemplateObjectModelHelper
             /cocoon/trunk/blocks/cocoon-template/cocoon-template-impl/src/main/java/org/apache/cocoon/template/environment/FlowObjectModelHelper.java
        
****************************************************************************
Output:
****************************************************************************
[INFO] Scanning for projects...
[INFO] Searching repository for plugin with prefix: 'source'.
[INFO] ----------------------------------------------------------------------------
[INFO] Building Template framework implementation
[INFO]    task-segment: [clean, source:jar, deploy]
[INFO] ----------------------------------------------------------------------------
[INFO] [clean:clean]
[INFO] Deleting directory /home/maven/continuum-1.0.3/apps/continuum/working-directory/137/target
[INFO] [source:jar]
[INFO] Building jar: /home/maven/continuum-1.0.3/apps/continuum/working-directory/137/target/cocoon-template-impl-1.0.0-SNAPSHOT-sources.jar
[INFO] [resources:resources]
[INFO] Using default encoding to copy filtered resources.
[INFO] snapshot org.apache.cocoon:cocoon-core:2.2.0-SNAPSHOT: checking for updates from central
[INFO] snapshot org.apache.cocoon:cocoon-core:2.2.0-SNAPSHOT: checking for updates from apache.snapshot
[INFO] snapshot org.apache.cocoon:cocoon-core:2.2.0-SNAPSHOT: checking for updates from apache-cvs
[INFO] snapshot org.apache.cocoon:cocoon-core:2.2.0-SNAPSHOT: checking for updates from apache.snapshots
[INFO] snapshot org.apache.cocoon:cocoon-core-modules:1-SNAPSHOT: checking for updates from
central
[INFO] snapshot org.apache.cocoon:cocoon-core-modules:1-SNAPSHOT: checking for updates from
apache.snapshot
[INFO] snapshot org.apache.cocoon:cocoon-core-modules:1-SNAPSHOT: checking for updates from
apache-cvs
[INFO] snapshot org.apache.cocoon:cocoon-core-modules:1-SNAPSHOT: checking for updates from
apache.snapshots
[WARNING] 
	Artifact javax.servlet:servlet-api:jar:2.3 retains local scope 'provided' overriding broader
scope 'compile'
	given by a dependency. If this is not intended, modify or remove the local scope.

[WARNING] 
	Artifact junit:junit:jar:3.8.2 retains local scope 'test' overriding broader scope 'compile'
	given by a dependency. If this is not intended, modify or remove the local scope.

[INFO] [compiler:compile]
Compiling 94 source files to /home/maven/continuum-1.0.3/apps/continuum/working-directory/137/target/classes
[INFO] ----------------------------------------------------------------------------
[ERROR] BUILD FAILURE
[INFO] ----------------------------------------------------------------------------
[INFO] Compilation failure

/home/maven/continuum-1.0.3/apps/continuum/working-directory/137/src/main/java/org/apache/cocoon/template/environment/FlowObjectModelHelper.java:[70,80]
incompatible types
found   : java.lang.Object
required: java.util.Map


[INFO] ----------------------------------------------------------------------------
[INFO] For more information, run Maven with the -e switch
[INFO] ----------------------------------------------------------------------------
[INFO] Total time: 24 seconds
[INFO] Finished at: Fri Jun 23 03:10:51 GMT+00:00 2006
[INFO] Final Memory: 6M/21M
[INFO] ----------------------------------------------------------------------------

****************************************************************************



Mime
View raw message