cocoon-dev mailing list archives

Site index · List index
Message view « Date » · « Thread »
Top « Date » · « Thread »
From "continuum@cocoon.zones.apache.org" <contin...@cocoon.zones.apache.org>
Subject [continuum] BUILD FAILURE: Maven Eclipse Plugin
Date Thu, 22 Jun 2006 03:14:29 GMT
Online report : http://cocoon.zones.apache.org:12000/continuum/servlet/continuum/target/ProjectBuild.vm/view/ProjectBuild/id/171/buildId/1484
Build statistics:
  State: Failed
  Previous State: Ok
  Started at: Thu, 22 Jun 2006 03:13:43 +0000
  Finished at: Thu, 22 Jun 2006 03:14:29 +0000
  Total time: 45s
  Build Trigger: Schedule
  Exit code: 1
  Building machine hostname: cocoon.zones.apache.org
  Operating system : SunOS(unknown)
  Java version : 1.4.2_06(Sun Microsystems Inc.)

Changes
         reinhard          merge with maven-eclipse-plugin rev 415916; tests don't run through
ATM but this is a problem with the maven-eclipse-plugin
             /cocoon/trunk/tools/cocoon-maven-eclipse-plugin
            /cocoon/trunk/tools/cocoon-maven-eclipse-plugin/pom.xml
            /cocoon/trunk/tools/cocoon-maven-eclipse-plugin/revision.txt
            /cocoon/trunk/tools/cocoon-maven-eclipse-plugin/src/main/java/org/apache/maven/plugin/eclipse/AddMavenRepoMojo.java
            /cocoon/trunk/tools/cocoon-maven-eclipse-plugin/src/main/java/org/apache/maven/plugin/ide/AbstractIdeSupportMojo.java
            /cocoon/trunk/tools/cocoon-maven-eclipse-plugin/src/test/java/org/apache/maven/plugin/eclipse/AddMavenRepoMojoTest.java
(from /maven/plugins/trunk/maven-eclipse-plugin/src/test/java/org/apache/maven/plugin/eclipse/AddMavenRepoMojoTest.java:415917)
            /cocoon/trunk/tools/cocoon-maven-eclipse-plugin/src/test/projects/project-12
            /cocoon/trunk/tools/cocoon-maven-eclipse-plugin/src/test/projects/project-13
            /cocoon/trunk/tools/cocoon-maven-eclipse-plugin/src/test/projects/project-14
            /cocoon/trunk/tools/cocoon-maven-eclipse-plugin/src/test/projects/project-15
            /cocoon/trunk/tools/cocoon-maven-eclipse-plugin/src/test/projects/project-19
            /cocoon/trunk/tools/cocoon-maven-eclipse-plugin/src/test/test-harness (from /maven/plugins/trunk/maven-eclipse-plugin/src/test/test-harness:415917)
            /cocoon/trunk/tools/cocoon-maven-eclipse-plugin/src/test/test-harness/add-maven-repo
(from /maven/plugins/trunk/maven-eclipse-plugin/src/test/test-harness/add-maven-repo:415917)
            /cocoon/trunk/tools/cocoon-maven-eclipse-plugin/src/test/test-harness/add-maven-repo/min-plugin-config.xml
(from /maven/plugins/trunk/maven-eclipse-plugin/src/test/test-harness/add-maven-repo/min-plugin-config.xml:415917)
           reinhard          delete lib dir in the case of an PDE project too
             /cocoon/trunk/tools/cocoon-maven-eclipse-plugin/src/main/java/org/apache/maven/plugin/eclipse/EclipseCleanMojo.java
            /cocoon/trunk/tools/cocoon-maven-eclipse-plugin/src/main/java/org/apache/maven/plugin/eclipse/writers/EclipseClasspathWriter.java
            /cocoon/trunk/tools/cocoon-maven-eclipse-plugin/src/main/resources/org/apache/maven/plugin/eclipse/messages.properties
        
****************************************************************************
Output:
****************************************************************************
[INFO] Scanning for projects...
[INFO] Searching repository for plugin with prefix: 'source'.
[INFO] ----------------------------------------------------------------------------
[INFO] Building Maven Eclipse Plugin
[INFO]    task-segment: [clean, source:jar, deploy]
[INFO] ----------------------------------------------------------------------------
[INFO] [clean:clean]
[INFO] Deleting directory /home/maven/continuum-1.0.3/apps/continuum/working-directory/171/target
[INFO] [source:jar]
[INFO] Building jar: /home/maven/continuum-1.0.3/apps/continuum/working-directory/171/target/cocoon-maven-eclipse-plugin-2.3-SNAPSHOT-sources.jar
[INFO] [plugin:descriptor]
[WARNING] Goal prefix is: c-eclipse; Maven currently expects it to be cocooneclipse
[INFO] [resources:resources]
[INFO] Using default encoding to copy filtered resources.
[INFO] snapshot org.apache.maven:maven-plugin-testing-harness:1.0-SNAPSHOT: checking for updates
from central
[INFO] snapshot org.apache.maven:maven-plugin-testing-harness:1.0-SNAPSHOT: checking for updates
from apache.snapshot
[INFO] snapshot org.apache.maven:maven-plugin-testing-harness:1.0-SNAPSHOT: checking for updates
from apache-cvs
[INFO] snapshot org.apache.maven:maven-plugin-testing-harness:1.0-SNAPSHOT: checking for updates
from apache.snapshots
Downloading: http://svn.apache.org/maven-snapshot-repository/org/apache/maven/maven-plugin-testing-harness/1.0-SNAPSHOT/maven-plugin-testing-harness-1.0-20060503.064125-4.pom
1K downloaded
Downloading: http://mirrors.dotsrc.org/maven2/org/apache/maven/maven-core/2.0/maven-core-2.0.pom
5K downloaded
Downloading: http://mirrors.dotsrc.org/maven2/org/apache/maven/maven-plugin-parameter-documenter/2.0/maven-plugin-parameter-documenter-2.0.pom
1K downloaded
Downloading: http://mirrors.dotsrc.org/maven2/org/apache/maven/maven-error-diagnostics/2.0/maven-error-diagnostics-2.0.pom
812b downloaded
Downloading: http://mirrors.dotsrc.org/maven2/org/apache/maven/maven-monitor/2.0/maven-monitor-2.0.pom
400b downloaded
Downloading: http://mirrors.dotsrc.org/maven2/org/apache/maven/maven-settings/2.0/maven-settings-2.0.pom
1K downloaded
[INFO] [compiler:compile]
Compiling 17 source files to /home/maven/continuum-1.0.3/apps/continuum/working-directory/171/target/classes
[INFO] [resources:testResources]
[INFO] Using default encoding to copy filtered resources.
Downloading: http://mirrors.dotsrc.org/maven2/org/apache/maven/maven-monitor/2.0/maven-monitor-2.0.jar
7K downloaded
Downloading: http://mirrors.dotsrc.org/maven2/org/apache/maven/reporting/maven-reporting-api/2.0/maven-reporting-api-2.0.jar
6K downloaded
Downloading: http://svn.apache.org/maven-snapshot-repository/org/apache/maven/maven-plugin-testing-harness/1.0-SNAPSHOT/maven-plugin-testing-harness-1.0-20060503.064125-4.jar
17K downloaded
Downloading: http://mirrors.dotsrc.org/maven2/org/apache/maven/maven-plugin-descriptor/2.0/maven-plugin-descriptor-2.0.jar
32K downloaded
Downloading: http://mirrors.dotsrc.org/maven2/org/apache/maven/maven-plugin-parameter-documenter/2.0/maven-plugin-parameter-documenter-2.0.jar
17K downloaded
Downloading: http://mirrors.dotsrc.org/maven2/doxia/doxia-sink-api/1.0-alpha-4/doxia-sink-api-1.0-alpha-4.jar
4K downloaded
Downloading: http://mirrors.dotsrc.org/maven2/org/apache/maven/maven-plugin-registry/2.0/maven-plugin-registry-2.0.jar
24K downloaded
Downloading: http://mirrors.dotsrc.org/maven2/org/apache/maven/maven-core/2.0/maven-core-2.0.jar
132K downloaded
Downloading: http://mirrors.dotsrc.org/maven2/org/apache/maven/maven-error-diagnostics/2.0/maven-error-diagnostics-2.0.jar
10K downloaded
[INFO] [compiler:testCompile]
Compiling 4 source files to /home/maven/continuum-1.0.3/apps/continuum/working-directory/171/target/test-classes
[INFO] [surefire:test]
[INFO] Surefire report directory: /home/maven/continuum-1.0.3/apps/continuum/working-directory/171/target/surefire-reports

-------------------------------------------------------
 T E S T S
-------------------------------------------------------
Running org.apache.maven.plugin.eclipse.AddMavenRepoMojoTest
Tests run: 1, Failures: 0, Errors: 1, Skipped: 0, Time elapsed: 0.538 sec <<< FAILURE!
Running org.apache.maven.plugin.eclipse.EclipsePluginTest
[ maven embedder INFO] ----------------------------------------------------------------------------
[ maven embedder INFO] Building Maven
[ maven embedder INFO]    task-segment: [org.apache.maven.plugins:maven-eclipse-plugin:clean,
org.apache.maven.plugins:maven-eclipse-plugin:eclipse]
[ maven embedder INFO] ----------------------------------------------------------------------------
[ maven embedder INFO] [eclipse:clean]
[ maven embedder INFO] Deleting .project file...
[ maven embedder INFO] Deleting .classpath file...
[ maven embedder INFO] Deleting .wtpmodules file...
[ maven embedder INFO] Deleting .component file...
[ maven embedder INFO] Deleting org.eclipse.wst.common.project.facet.core.xml file...
[ maven embedder INFO] Preparing eclipse:eclipse
[ maven embedder INFO] No goals needed for project - skipping
[ maven embedder INFO] [eclipse:eclipse]
[ maven embedder INFO] Adding support for WTP version R7.
[ maven embedder INFO] Not writing settings - defaults suffice
[ maven embedder INFO] Wrote Eclipse project for "maven-eclipse-plugin-test-project-1" to
/home/maven/continuum-1.0.3/apps/continuum/working-directory/171/src/test/projects/project-1.
[ maven embedder INFO] ----------------------------------------------------------------------------
[ maven embedder INFO] Building Maven
[ maven embedder INFO]    task-segment: [org.apache.maven.plugins:maven-eclipse-plugin:clean,
org.apache.maven.plugins:maven-eclipse-plugin:eclipse]
[ maven embedder INFO] ----------------------------------------------------------------------------
[ maven embedder INFO] [eclipse:clean]
[ maven embedder INFO] Deleting .project file...
[ maven embedder INFO] Deleting .classpath file...
[ maven embedder INFO] Deleting .wtpmodules file...
[ maven embedder INFO] Deleting .component file...
[ maven embedder INFO] Deleting org.eclipse.wst.common.project.facet.core.xml file...
[ maven embedder INFO] Preparing eclipse:eclipse
[ maven embedder INFO] No goals needed for project - skipping
[ maven embedder INFO] [eclipse:eclipse]
[ maven embedder INFO] Adding support for WTP version R7.
[ maven embedder INFO] Wrote Eclipse project for "maven-eclipse-plugin-test-project-2" to
/home/maven/continuum-1.0.3/apps/continuum/working-directory/171/src/test/projects/project-2.
[ maven embedder INFO] 
       Sources for some artifacts are not available.
       Please run the same goal with the -DdownloadSources=true parameter in order to check
remote repositories for sources.
       List of artifacts without a source archive:
         o junit:junit:2.0

[ maven embedder INFO] ----------------------------------------------------------------------------
[ maven embedder INFO] Building Maven
[ maven embedder INFO]    task-segment: [org.apache.maven.plugins:maven-eclipse-plugin:clean,
org.apache.maven.plugins:maven-eclipse-plugin:eclipse]
[ maven embedder INFO] ----------------------------------------------------------------------------
[ maven embedder INFO] [eclipse:clean]
[ maven embedder INFO] Deleting .project file...
[ maven embedder INFO] Deleting .classpath file...
[ maven embedder INFO] Deleting .wtpmodules file...
[ maven embedder INFO] Deleting .component file...
[ maven embedder INFO] Deleting org.eclipse.wst.common.project.facet.core.xml file...
[ maven embedder INFO] Preparing eclipse:eclipse
[ maven embedder INFO] No goals needed for project - skipping
[ maven embedder INFO] [eclipse:eclipse]
[ maven embedder INFO] Adding support for WTP version R7.
[ maven embedder WARNING] This plugin currently doesn't support include patterns for resources.
Adding the entire directory.
[ maven embedder WARNING] This plugin currently doesn't support exclude patterns for resources.
Adding the entire directory.
[ maven embedder WARNING] This plugin currently doesn't support include patterns for resources.
Adding the entire directory.
[ maven embedder WARNING] This plugin currently doesn't support exclude patterns for resources.
Adding the entire directory.
[ maven embedder INFO] Not writing settings - defaults suffice
[ maven embedder INFO] Wrote Eclipse project for "maven-eclipse-plugin-test-project-3" to
/home/maven/continuum-1.0.3/apps/continuum/working-directory/171/src/test/projects/project-3.
[ maven embedder INFO] 
       Sources for some artifacts are not available.
       Please run the same goal with the -DdownloadSources=true parameter in order to check
remote repositories for sources.
       List of artifacts without a source archive:
         o junit:junit:2.0

[ maven embedder INFO] ----------------------------------------------------------------------------
[ maven embedder INFO] Building Maven
[ maven embedder INFO]    task-segment: [org.apache.maven.plugins:maven-eclipse-plugin:clean,
org.apache.maven.plugins:maven-eclipse-plugin:eclipse]
[ maven embedder INFO] ----------------------------------------------------------------------------
[ maven embedder INFO] [eclipse:clean]
[ maven embedder INFO] Deleting .project file...
[ maven embedder INFO] Deleting .classpath file...
[ maven embedder INFO] Deleting .wtpmodules file...
[ maven embedder INFO] Deleting .component file...
[ maven embedder INFO] Deleting org.eclipse.wst.common.project.facet.core.xml file...
[ maven embedder INFO] Preparing eclipse:eclipse
[ maven embedder INFO] No goals needed for project - skipping
[ maven embedder INFO] [eclipse:eclipse]
[ maven embedder INFO] Adding support for WTP version R7.
[ maven embedder INFO] Wrote settings to /home/maven/continuum-1.0.3/apps/continuum/working-directory/171/target/project-4-test/maven-eclipse-plugin-test-project-4/.settings/org.eclipse.jdt.core.prefs
[ maven embedder INFO] Wrote Eclipse project for "maven-eclipse-plugin-test-project-4" to
/home/maven/continuum-1.0.3/apps/continuum/working-directory/171/src/test/projects/project-4/../../../../target/project-4-test/maven-eclipse-plugin-test-project-4.
[ maven embedder INFO] 
       Sources for some artifacts are not available.
       Please run the same goal with the -DdownloadSources=true parameter in order to check
remote repositories for sources.
       List of artifacts without a source archive:
         o junit:junit:2.0

[ maven embedder INFO] ----------------------------------------------------------------------------
[ maven embedder INFO] Building Maven
[ maven embedder INFO]    task-segment: [org.apache.maven.plugins:maven-eclipse-plugin:clean,
org.apache.maven.plugins:maven-eclipse-plugin:eclipse]
[ maven embedder INFO] ----------------------------------------------------------------------------
[ maven embedder INFO] [eclipse:clean]
[ maven embedder INFO] Deleting .project file...
[ maven embedder INFO] Deleting .classpath file...
[ maven embedder INFO] Deleting .wtpmodules file...
[ maven embedder INFO] Deleting .component file...
[ maven embedder INFO] Deleting org.eclipse.wst.common.project.facet.core.xml file...
[ maven embedder INFO] Preparing eclipse:eclipse
[ maven embedder INFO] No goals needed for project - skipping
[ maven embedder INFO] [eclipse:eclipse]
[ maven embedder INFO] Adding support for WTP version R7.
[ maven embedder WARNING] You did specify a list of classpath containers without the base
org.eclipse.jdt.launching.JRE_CONTAINER.
       If you specify custom classpath containers you should also add org.eclipse.jdt.launching.JRE_CONTAINER
to the list
[ maven embedder INFO] Wrote Eclipse project for "maven-eclipse-plugin-test-project-5" to
/home/maven/continuum-1.0.3/apps/continuum/working-directory/171/src/test/projects/project-5.
[ maven embedder INFO] ----------------------------------------------------------------------------
[ maven embedder INFO] Building Maven
[ maven embedder INFO]    task-segment: [org.apache.maven.plugins:maven-eclipse-plugin:clean,
org.apache.maven.plugins:maven-eclipse-plugin:eclipse]
[ maven embedder INFO] ----------------------------------------------------------------------------
[ maven embedder INFO] [eclipse:clean]
[ maven embedder INFO] Deleting .project file...
[ maven embedder INFO] Deleting .classpath file...
[ maven embedder INFO] Deleting .wtpmodules file...
[ maven embedder INFO] Deleting .component file...
[ maven embedder INFO] Deleting org.eclipse.wst.common.project.facet.core.xml file...
[ maven embedder INFO] Preparing eclipse:eclipse
[ maven embedder INFO] No goals needed for project - skipping
[ maven embedder INFO] [eclipse:eclipse]
[ maven embedder INFO] Adding support for WTP version R7.
[ maven embedder INFO] Not writing settings - defaults suffice
[ maven embedder INFO] Wrote Eclipse project for "maven-eclipse-plugin-test-project-6" to
/home/maven/continuum-1.0.3/apps/continuum/working-directory/171/src/test/projects/project-6.
[ maven embedder INFO] ----------------------------------------------------------------------------
[ maven embedder INFO] Building Maven
[ maven embedder INFO]    task-segment: [org.apache.maven.plugins:maven-eclipse-plugin:clean,
org.apache.maven.plugins:maven-eclipse-plugin:eclipse]
[ maven embedder INFO] ----------------------------------------------------------------------------
[ maven embedder INFO] [eclipse:clean]
[ maven embedder INFO] Deleting .project file...
[ maven embedder INFO] Deleting .classpath file...
[ maven embedder INFO] Deleting .wtpmodules file...
[ maven embedder INFO] Deleting .component file...
[ maven embedder INFO] Deleting org.eclipse.wst.common.project.facet.core.xml file...
[ maven embedder INFO] Preparing eclipse:eclipse
[ maven embedder INFO] No goals needed for project - skipping
[ maven embedder INFO] [eclipse:eclipse]
[ maven embedder INFO] Adding support for WTP version R7.
[ maven embedder INFO] Not writing settings - defaults suffice
[ maven embedder INFO] Wrote Eclipse project for "maven-eclipse-plugin-test-project-8" to
/home/maven/continuum-1.0.3/apps/continuum/working-directory/171/src/test/projects/project-8.
[ maven embedder INFO] ----------------------------------------------------------------------------
[ maven embedder INFO] Building Maven
[ maven embedder INFO]    task-segment: [org.apache.maven.plugins:maven-eclipse-plugin:clean,
org.apache.maven.plugins:maven-eclipse-plugin:eclipse]
[ maven embedder INFO] ----------------------------------------------------------------------------
[ maven embedder INFO] [eclipse:clean]
[ maven embedder INFO] Deleting .project file...
[ maven embedder INFO] Deleting .classpath file...
[ maven embedder INFO] Deleting .wtpmodules file...
[ maven embedder INFO] Deleting .component file...
[ maven embedder INFO] Deleting org.eclipse.wst.common.project.facet.core.xml file...
[ maven embedder INFO] Preparing eclipse:eclipse
[ maven embedder INFO] No goals needed for project - skipping
[ maven embedder INFO] [eclipse:eclipse]
[ maven embedder INFO] Adding support for WTP version R7.
[ maven embedder INFO] Not writing settings - defaults suffice
[ maven embedder INFO] Wrote Eclipse project for "maven-eclipse-plugin-test-project-9" to
/home/maven/continuum-1.0.3/apps/continuum/working-directory/171/src/test/projects/project-9/../../../../target/project-9-test/maven-eclipse-plugin-test-project-9.
[ maven embedder INFO] 
       Sources for some artifacts are not available.
       Please run the same goal with the -DdownloadSources=true parameter in order to check
remote repositories for sources.
       List of artifacts without a source archive:
         o junit:junit:2.0

[ maven embedder INFO] ----------------------------------------------------------------------------
[ maven embedder INFO] Building Maven
[ maven embedder INFO]    task-segment: [org.apache.maven.plugins:maven-eclipse-plugin:clean,
org.apache.maven.plugins:maven-eclipse-plugin:eclipse]
[ maven embedder INFO] ----------------------------------------------------------------------------
[ maven embedder INFO] [eclipse:clean]
[ maven embedder INFO] Deleting .project file...
[ maven embedder INFO] Deleting .classpath file...
[ maven embedder INFO] Deleting .wtpmodules file...
[ maven embedder INFO] Deleting .component file...
[ maven embedder INFO] Deleting org.eclipse.wst.common.project.facet.core.xml file...
[ maven embedder INFO] Preparing eclipse:eclipse
[ maven embedder INFO] No goals needed for project - skipping
[ maven embedder INFO] [eclipse:eclipse]
[ maven embedder INFO] Adding support for WTP version R7.
[ maven embedder INFO] Wrote Eclipse project for "maven-eclipse-plugin-test-project-2" to
/home/maven/continuum-1.0.3/apps/continuum/working-directory/171/src/test/projects/project-10.
[ maven embedder INFO] 
       Sources for some artifacts are not available.
       Please run the same goal with the -DdownloadSources=true parameter in order to check
remote repositories for sources.
       List of artifacts without a source archive:
         o junit:junit:3.0

[ maven embedder INFO] ----------------------------------------------------------------------------
[ maven embedder INFO] Building Maven
[ maven embedder INFO]    task-segment: [org.apache.maven.plugins:maven-eclipse-plugin:clean,
org.apache.maven.plugins:maven-eclipse-plugin:eclipse]
[ maven embedder INFO] ----------------------------------------------------------------------------
[ maven embedder INFO] [eclipse:clean]
[ maven embedder INFO] Deleting .project file...
[ maven embedder INFO] Deleting .classpath file...
[ maven embedder INFO] Deleting .wtpmodules file...
[ maven embedder INFO] Deleting .component file...
[ maven embedder INFO] Deleting org.eclipse.wst.common.project.facet.core.xml file...
[ maven embedder INFO] Preparing eclipse:eclipse
[ maven embedder INFO] Setting property: classpath.resource.loader.class => 'org.codehaus.plexus.velocity.ContextClassLoaderResourceLoader'.
[ maven embedder INFO] Setting property: velocimacro.messages.on => 'false'.
[ maven embedder INFO] Setting property: resource.loader => 'classpath'.
[ maven embedder INFO] Setting property: resource.manager.logwhenfound => 'false'.
[ maven embedder INFO] ************************************************************** 
[ maven embedder INFO] Starting Jakarta Velocity v1.4
[ maven embedder INFO] RuntimeInstance initializing.
[ maven embedder INFO] Default Properties File: org/apache/velocity/runtime/defaults/velocity.properties
[ maven embedder INFO] Default ResourceManager initializing. (class org.apache.velocity.runtime.resource.ResourceManagerImpl)
[ maven embedder INFO] Resource Loader Instantiated: org.codehaus.plexus.velocity.ContextClassLoaderResourceLoader
[ maven embedder INFO] ClasspathResourceLoader : initialization starting.
[ maven embedder INFO] ClasspathResourceLoader : initialization complete.
[ maven embedder INFO] ResourceCache : initialized. (class org.apache.velocity.runtime.resource.ResourceCacheImpl)
[ maven embedder INFO] Default ResourceManager initialization complete.
[ maven embedder INFO] Loaded System Directive: org.apache.velocity.runtime.directive.Literal
[ maven embedder INFO] Loaded System Directive: org.apache.velocity.runtime.directive.Macro
[ maven embedder INFO] Loaded System Directive: org.apache.velocity.runtime.directive.Parse
[ maven embedder INFO] Loaded System Directive: org.apache.velocity.runtime.directive.Include
[ maven embedder INFO] Loaded System Directive: org.apache.velocity.runtime.directive.Foreach
[ maven embedder INFO] Created: 20 parsers.
[ maven embedder INFO] Velocimacro : initialization starting.
[ maven embedder INFO] Velocimacro : adding VMs from VM library template : VM_global_library.vm
[ maven embedder ERROR] ResourceManager : unable to find resource 'VM_global_library.vm' in
any resource loader.
[ maven embedder INFO] Velocimacro : error using  VM library template VM_global_library.vm
: org.apache.velocity.exception.ResourceNotFoundException: Unable to find resource 'VM_global_library.vm'
[ maven embedder INFO] Velocimacro :  VM library template macro registration complete.
[ maven embedder INFO] Velocimacro : allowInline = true : VMs can be defined inline in templates
[ maven embedder INFO] Velocimacro : allowInlineToOverride = false : VMs defined inline may
NOT replace previous VM definitions
[ maven embedder INFO] Velocimacro : allowInlineLocal = false : VMs defined inline will be
 global in scope if allowed.
[ maven embedder INFO] Velocimacro : initialization complete.
[ maven embedder INFO] Velocity successfully started.
[ maven embedder INFO] [modello:java {execution: default}]
[ maven embedder INFO] outputDirectory: /home/maven/continuum-1.0.3/apps/continuum/working-directory/171/src/test/projects/project-11/target/generated-sources/modello
[ maven embedder INFO] [eclipse:eclipse]
[ maven embedder INFO] Adding support for WTP version R7.
[ maven embedder INFO] Not writing settings - defaults suffice
[ maven embedder INFO] Wrote Eclipse project for "maven-eclipse-plugin-test-project-2" to
/home/maven/continuum-1.0.3/apps/continuum/working-directory/171/src/test/projects/project-11.
[ maven embedder INFO] ----------------------------------------------------------------------------
[ maven embedder INFO] Building Unnamed - eclipse:maven-eclipse-plugin-test-project-12:ear:12
[ maven embedder INFO]    task-segment: [org.apache.maven.plugins:maven-eclipse-plugin:clean,
org.apache.maven.plugins:maven-eclipse-plugin:eclipse]
[ maven embedder INFO] ----------------------------------------------------------------------------
[ maven embedder INFO] [eclipse:clean]
[ maven embedder INFO] Deleting .project file...
[ maven embedder INFO] Deleting .classpath file...
[ maven embedder INFO] Deleting .wtpmodules file...
[ maven embedder INFO] Deleting .component file...
[ maven embedder INFO] Deleting org.eclipse.wst.common.project.facet.core.xml file...
[ maven embedder INFO] Deleting .settings file...
[ maven embedder INFO] Preparing eclipse:eclipse
[ maven embedder INFO] [ear:generate-application-xml]
[ maven embedder INFO] Generating application.xml
[ maven embedder INFO] [eclipse:eclipse]
[ maven embedder INFO] Adding support for WTP version 1.0.
[ maven embedder INFO] Not writing settings - defaults suffice
[ maven embedder INFO] Wrote Eclipse project for "maven-eclipse-plugin-test-project-12" to
/home/maven/continuum-1.0.3/apps/continuum/working-directory/171/src/test/projects/project-12.
[ maven embedder INFO] ----------------------------------------------------------------------------
[ maven embedder INFO] Building Unnamed - eclipse:maven-eclipse-plugin-test-project-13:jar:13
[ maven embedder INFO]    task-segment: [org.apache.maven.plugins:maven-eclipse-plugin:clean,
org.apache.maven.plugins:maven-eclipse-plugin:eclipse]
[ maven embedder INFO] ----------------------------------------------------------------------------
[ maven embedder INFO] [eclipse:clean]
[ maven embedder INFO] Deleting .project file...
[ maven embedder INFO] Deleting .classpath file...
[ maven embedder INFO] Deleting .wtpmodules file...
[ maven embedder INFO] Deleting .component file...
[ maven embedder INFO] Deleting org.eclipse.wst.common.project.facet.core.xml file...
[ maven embedder INFO] Preparing eclipse:eclipse
[ maven embedder INFO] No goals needed for project - skipping
[ maven embedder INFO] [eclipse:eclipse]
[ maven embedder INFO] Not writing settings - defaults suffice
[ maven embedder INFO] Wrote Eclipse project for "maven-eclipse-plugin-test-project-13" to
/home/maven/continuum-1.0.3/apps/continuum/working-directory/171/src/test/projects/project-13.
[ maven embedder INFO] 
       Sources for some artifacts are not available.
       Please run the same goal with the -DdownloadSources=true parameter in order to check
remote repositories for sources.
       List of artifacts without a source archive:
         o junit:junit:3.8.1

[ maven embedder INFO] ----------------------------------------------------------------------------
[ maven embedder INFO] Building maven-eclipse-plugin-test-project-14en
[ maven embedder INFO]    task-segment: [org.apache.maven.plugins:maven-eclipse-plugin:clean,
org.apache.maven.plugins:maven-eclipse-plugin:eclipse]
[ maven embedder INFO] ----------------------------------------------------------------------------
[ maven embedder INFO] [eclipse:clean]
[ maven embedder INFO] Deleting .project file...
[ maven embedder INFO] Deleting .classpath file...
[ maven embedder INFO] Deleting .wtpmodules file...
[ maven embedder INFO] Deleting .component file...
[ maven embedder INFO] Deleting org.eclipse.wst.common.project.facet.core.xml file...
[ maven embedder INFO] Preparing eclipse:eclipse
[ maven embedder INFO] No goals needed for project - skipping
[ maven embedder INFO] [eclipse:eclipse]
[ maven embedder INFO] Not writing settings - defaults suffice
[ maven embedder INFO] Wrote Eclipse project for "maven-eclipse-plugin-test-project-14" to
/home/maven/continuum-1.0.3/apps/continuum/working-directory/171/src/test/projects/project-14.
[ maven embedder INFO] ----------------------------------------------------------------------------
[ maven embedder INFO] Building maven-eclipse-plugin-test-project-15
[ maven embedder INFO]    task-segment: [org.apache.maven.plugins:maven-eclipse-plugin:clean,
org.apache.maven.plugins:maven-eclipse-plugin:eclipse]
[ maven embedder INFO] ----------------------------------------------------------------------------
[ maven embedder INFO] [eclipse:clean]
[ maven embedder INFO] Deleting .project file...
[ maven embedder INFO] Deleting .classpath file...
[ maven embedder INFO] Deleting .wtpmodules file...
[ maven embedder INFO] Deleting .component file...
[ maven embedder INFO] Deleting org.eclipse.wst.common.project.facet.core.xml file...
[ maven embedder INFO] Preparing eclipse:eclipse
[ maven embedder INFO] No goals needed for project - skipping
[ maven embedder INFO] [eclipse:eclipse]
[ maven embedder INFO] Not writing settings - defaults suffice
[ maven embedder INFO] Wrote Eclipse project for "maven-eclipse-plugin-test-project-15" to
/home/maven/continuum-1.0.3/apps/continuum/working-directory/171/src/test/projects/project-15.
[ maven embedder INFO] ----------------------------------------------------------------------------
[ maven embedder INFO] Building maven-eclipse-plugin-test-project-18
[ maven embedder INFO]    task-segment: [org.apache.maven.plugins:maven-eclipse-plugin:clean,
org.apache.maven.plugins:maven-eclipse-plugin:eclipse]
[ maven embedder INFO] ----------------------------------------------------------------------------
[ maven embedder INFO] [eclipse:clean]
[ maven embedder INFO] Deleting .project file...
[ maven embedder INFO] Deleting .classpath file...
[ maven embedder INFO] Deleting .wtpmodules file...
[ maven embedder INFO] Deleting .component file...
[ maven embedder INFO] Deleting org.eclipse.wst.common.project.facet.core.xml file...
[ maven embedder INFO] Preparing eclipse:eclipse
[ maven embedder INFO] No goals needed for project - skipping
[ maven embedder INFO] [eclipse:eclipse]
[ maven embedder INFO] Not writing settings - defaults suffice
[ maven embedder INFO] Wrote Eclipse project for "maven-eclipse-plugin-test-project-18" to
/home/maven/continuum-1.0.3/apps/continuum/working-directory/171/src/test/projects/project-18/../../../../target/project-18-test/maven-eclipse-plugin-test-project-18.
[ maven embedder INFO] ----------------------------------------------------------------------------
[ maven embedder INFO] Building maven-eclipse-plugin-test-project-19
[ maven embedder INFO]    task-segment: [org.apache.maven.plugins:maven-eclipse-plugin:clean,
org.apache.maven.plugins:maven-eclipse-plugin:eclipse]
[ maven embedder INFO] ----------------------------------------------------------------------------
[ maven embedder INFO] [eclipse:clean]
[ maven embedder INFO] Deleting .project file...
[ maven embedder INFO] Deleting .classpath file...
[ maven embedder INFO] Deleting .wtpmodules file...
[ maven embedder INFO] Deleting .component file...
[ maven embedder INFO] Deleting org.eclipse.wst.common.project.facet.core.xml file...
[ maven embedder INFO] Preparing eclipse:eclipse
[ maven embedder INFO] No goals needed for project - skipping
[ maven embedder INFO] [eclipse:eclipse]
[ maven embedder INFO] Not writing settings - defaults suffice
[ maven embedder INFO] Wrote Eclipse project for "maven-eclipse-plugin-test-project-19" to
/home/maven/continuum-1.0.3/apps/continuum/working-directory/171/src/test/projects/project-19.
Tests run: 16, Failures: 0, Errors: 0, Skipped: 0, Time elapsed: 22.344 sec

Results :
Tests run: 17, Failures: 0, Errors: 1, Skipped: 0

[INFO] ----------------------------------------------------------------------------
[ERROR] BUILD FAILURE
[INFO] ----------------------------------------------------------------------------
[INFO] There are test failures.
[INFO] ----------------------------------------------------------------------------
[INFO] For more information, run Maven with the -e switch
[INFO] ----------------------------------------------------------------------------
[INFO] Total time: 44 seconds
[INFO] Finished at: Thu Jun 22 03:14:29 GMT+00:00 2006
[INFO] Final Memory: 7M/18M
[INFO] ----------------------------------------------------------------------------

****************************************************************************



Mime
View raw message