cocoon-dev mailing list archives

Site index · List index
Message view « Date » · « Thread »
Top « Date » · « Thread »
From "continuum@cocoon.zones.apache.org" <contin...@cocoon.zones.apache.org>
Subject [continuum] BUILD FAILURE: Template framework implementation
Date Wed, 28 Jun 2006 20:41:51 GMT
Online report : http://cocoon.zones.apache.org:12000/continuum/servlet/continuum/target/ProjectBuild.vm/view/ProjectBuild/id/137/buildId/1548
Build statistics:
  State: Failed
  Previous State: Failed
  Started at: Wed, 28 Jun 2006 20:41:30 +0000
  Finished at: Wed, 28 Jun 2006 20:41:50 +0000
  Total time: 20s
  Build Trigger: Forced
  Exit code: 1
  Building machine hostname: cocoon.zones.apache.org
  Operating system : SunOS(unknown)
  Java version : 1.4.2_06(Sun Microsystems Inc.)

Changes
      No files changed
  
****************************************************************************
Output:
****************************************************************************
[INFO] Scanning for projects...
[INFO] Searching repository for plugin with prefix: 'source'.
[INFO] ----------------------------------------------------------------------------
[INFO] Building Template framework implementation
[INFO]    task-segment: [clean, source:jar, deploy]
[INFO] ----------------------------------------------------------------------------
[INFO] [clean:clean]
[INFO] Deleting directory /home/maven/continuum-1.0.3/apps/continuum/working-directory/137/target
[INFO] [source:jar]
[INFO] Building jar: /home/maven/continuum-1.0.3/apps/continuum/working-directory/137/target/cocoon-template-impl-1.0.0-SNAPSHOT-sources.jar
[INFO] [resources:resources]
[INFO] Using default encoding to copy filtered resources.
[INFO] snapshot org.apache.cocoon:cocoon-core-modules:1-SNAPSHOT: checking for updates from
central
[INFO] snapshot org.apache.cocoon:cocoon-core-modules:1-SNAPSHOT: checking for updates from
apache.snapshot
[INFO] snapshot org.apache.cocoon:cocoon-core-modules:1-SNAPSHOT: checking for updates from
apache-cvs
Downloading: http://mirrors.dotsrc.org/maven2/org/springframework/spring-context/2.0-rc1/spring-context-2.0-rc1.pom
[WARNING] Unable to get resource from repository central (http://ibiblio.org/maven2)
Downloading: http://svn.apache.org/maven-snapshot-repository/org/springframework/spring-context/2.0-rc1/spring-context-2.0-rc1.pom
[WARNING] Unable to get resource from repository apache.snapshot (http://svn.apache.org/maven-snapshot-repository)
Downloading: http://svn.apache.org/repository/org.springframework/poms/spring-context-2.0-rc1.pom
[WARNING] Unable to get resource from repository apache-cvs (http://svn.apache.org/repository)
[WARNING] 
	Artifact javax.servlet:servlet-api:jar:2.3 retains local scope 'provided' overriding broader
scope 'compile'
	given by a dependency. If this is not intended, modify or remove the local scope.

[WARNING] 
	Artifact junit:junit:jar:3.8.2 retains local scope 'test' overriding broader scope 'compile'
	given by a dependency. If this is not intended, modify or remove the local scope.

Downloading: http://mirrors.dotsrc.org/maven2/org/springframework/spring-aop/2.0-rc1/spring-aop-2.0-rc1.pom
[WARNING] Unable to get resource from repository central (http://ibiblio.org/maven2)
Downloading: http://svn.apache.org/maven-snapshot-repository/org/springframework/spring-aop/2.0-rc1/spring-aop-2.0-rc1.pom
[WARNING] Unable to get resource from repository apache.snapshot (http://svn.apache.org/maven-snapshot-repository)
Downloading: http://svn.apache.org/repository/org.springframework/poms/spring-aop-2.0-rc1.pom
[WARNING] Unable to get resource from repository apache-cvs (http://svn.apache.org/repository)
Downloading: http://mirrors.dotsrc.org/maven2/org/springframework/spring-web/2.0-rc1/spring-web-2.0-rc1.pom
[WARNING] Unable to get resource from repository central (http://ibiblio.org/maven2)
Downloading: http://svn.apache.org/maven-snapshot-repository/org/springframework/spring-web/2.0-rc1/spring-web-2.0-rc1.pom
[WARNING] Unable to get resource from repository apache.snapshot (http://svn.apache.org/maven-snapshot-repository)
Downloading: http://svn.apache.org/repository/org.springframework/poms/spring-web-2.0-rc1.pom
[WARNING] Unable to get resource from repository apache-cvs (http://svn.apache.org/repository)
Downloading: http://mirrors.dotsrc.org/maven2/org/springframework/spring-core/2.0-rc1/spring-core-2.0-rc1.pom
[WARNING] Unable to get resource from repository central (http://ibiblio.org/maven2)
Downloading: http://svn.apache.org/maven-snapshot-repository/org/springframework/spring-core/2.0-rc1/spring-core-2.0-rc1.pom
[WARNING] Unable to get resource from repository apache.snapshot (http://svn.apache.org/maven-snapshot-repository)
Downloading: http://svn.apache.org/repository/org.springframework/poms/spring-core-2.0-rc1.pom
[WARNING] Unable to get resource from repository apache-cvs (http://svn.apache.org/repository)
Downloading: http://mirrors.dotsrc.org/maven2/org/springframework/spring-beans/2.0-rc1/spring-beans-2.0-rc1.pom
[WARNING] Unable to get resource from repository central (http://ibiblio.org/maven2)
Downloading: http://svn.apache.org/maven-snapshot-repository/org/springframework/spring-beans/2.0-rc1/spring-beans-2.0-rc1.pom
[WARNING] Unable to get resource from repository apache.snapshot (http://svn.apache.org/maven-snapshot-repository)
Downloading: http://svn.apache.org/repository/org.springframework/poms/spring-beans-2.0-rc1.pom
[WARNING] Unable to get resource from repository apache-cvs (http://svn.apache.org/repository)
[INFO] [compiler:compile]
Compiling 94 source files to /home/maven/continuum-1.0.3/apps/continuum/working-directory/137/target/classes
[INFO] [resources:testResources]
[INFO] Using default encoding to copy filtered resources.
[INFO] [compiler:testCompile]
Compiling 7 source files to /home/maven/continuum-1.0.3/apps/continuum/working-directory/137/target/test-classes
[INFO] [surefire:test]
[INFO] Surefire report directory: /home/maven/continuum-1.0.3/apps/continuum/working-directory/137/target/surefire-reports

-------------------------------------------------------
 T E S T S
-------------------------------------------------------
Running org.apache.cocoon.components.expression.jexl.JexlTestCase
log4j:WARN No appenders could be found for logger (org.apache.commons.jexl.ExpressionFactory).
log4j:WARN Please initialize the log4j system properly.
Tests run: 3, Failures: 0, Errors: 0, Skipped: 0, Time elapsed: 0.166 sec
Running org.apache.cocoon.components.expression.ExpressionTestCase
Tests run: 5, Failures: 0, Errors: 0, Skipped: 0, Time elapsed: 1.077 sec
Running org.apache.cocoon.environment.FOMTestCase
Tests run: 2, Failures: 1, Errors: 1, Skipped: 0, Time elapsed: 0.329 sec <<< FAILURE!
Running org.apache.cocoon.components.accessor.AccessorTestCase
Tests run: 4, Failures: 0, Errors: 0, Skipped: 0, Time elapsed: 0.286 sec
Running org.apache.cocoon.template.jxtg.JXTemplateGeneratorTestCase
Tests run: 14, Failures: 1, Errors: 1, Skipped: 0, Time elapsed: 1.642 sec <<< FAILURE!
Running org.apache.cocoon.components.expression.javascript.JavaScriptTestCase
Tests run: 3, Failures: 0, Errors: 0, Skipped: 0, Time elapsed: 0.079 sec
Running org.apache.cocoon.components.expression.jxpath.JXPathTestCase
Tests run: 3, Failures: 0, Errors: 0, Skipped: 0, Time elapsed: 0.012 sec

Results :
Tests run: 34, Failures: 2, Errors: 2, Skipped: 0

[INFO] ----------------------------------------------------------------------------
[ERROR] BUILD FAILURE
[INFO] ----------------------------------------------------------------------------
[INFO] There are test failures.
[INFO] ----------------------------------------------------------------------------
[INFO] For more information, run Maven with the -e switch
[INFO] ----------------------------------------------------------------------------
[INFO] Total time: 19 seconds
[INFO] Finished at: Wed Jun 28 20:41:50 GMT+00:00 2006
[INFO] Final Memory: 6M/24M
[INFO] ----------------------------------------------------------------------------

****************************************************************************



Mime
View raw message