cocoon-dev mailing list archives

Site index · List index
Message view « Date » · « Thread »
Top « Date » · « Thread »
From "continuum@cocoon.zones.apache.org" <contin...@cocoon.zones.apache.org>
Subject [continuum] BUILD FAILURE: Template framework implementation
Date Sat, 24 Jun 2006 03:21:04 GMT
Online report : http://cocoon.zones.apache.org:12000/continuum/servlet/continuum/target/ProjectBuild.vm/view/ProjectBuild/id/137/buildId/1503
Build statistics:
  State: Failed
  Previous State: Failed
  Started at: Sat, 24 Jun 2006 03:20:45 +0000
  Finished at: Sat, 24 Jun 2006 03:21:04 +0000
  Total time: 18s
  Build Trigger: Schedule
  Exit code: 1
  Building machine hostname: cocoon.zones.apache.org
  Operating system : SunOS(unknown)
  Java version : 1.4.2_06(Sun Microsystems Inc.)

Changes
         cziegeler          Cleanup
             /cocoon/trunk/blocks/cocoon-databases/cocoon-databases-impl/src/main/java/org/apache/cocoon/transformation/SQLTransformer.java
            /cocoon/trunk/blocks/cocoon-forms/cocoon-forms-impl/src/main/java/org/apache/cocoon/forms/binding/JXPathBindingBase.java
            /cocoon/trunk/blocks/cocoon-forms/cocoon-forms-impl/src/main/java/org/apache/cocoon/forms/formmodel/tree/SourceTreeModel.java
            /cocoon/trunk/blocks/cocoon-forms/cocoon-forms-impl/src/main/java/org/apache/cocoon/forms/formmodel/tree/SourceTreeModelDefinition.java
            /cocoon/trunk/blocks/cocoon-forms/cocoon-forms-impl/src/main/java/org/apache/cocoon/forms/formmodel/tree/builder/SourceTreeModelDefinitionBuilder.java
            /cocoon/trunk/blocks/cocoon-scratchpad/cocoon-scratchpad-impl/src/main/java/org/apache/cocoon/components/flow/javascript/fom/JavaScriptAspectWeaver.java
            /cocoon/trunk/blocks/cocoon-scratchpad/cocoon-scratchpad-impl/src/main/java/org/apache/cocoon/components/flow/ws/EndpointDefinition.java
            /cocoon/trunk/blocks/cocoon-scratchpad/cocoon-scratchpad-impl/src/main/java/org/apache/cocoon/components/source/impl/DelayRefresher.java
            /cocoon/trunk/blocks/cocoon-scratchpad/cocoon-scratchpad-impl/src/main/java/org/apache/cocoon/generation/RequestParameterGenerator.java
            /cocoon/trunk/blocks/cocoon-template/cocoon-template-impl/src/main/java/org/apache/cocoon/components/expression/javascript/JavaScriptExpression.java
           cziegeler          Make constants final and fix potential problems
             /cocoon/trunk/blocks/cocoon-batik/cocoon-batik-impl/src/main/java/org/apache/cocoon/components/transcoder/ExtendableTranscoderFactory.java
            /cocoon/trunk/blocks/cocoon-batik/cocoon-batik-impl/src/main/java/org/apache/cocoon/components/url/SourceProtocolHandler.java
            /cocoon/trunk/blocks/cocoon-fop/cocoon-fop-impl/src/main/java/org/apache/cocoon/components/renderer/ExtendableRendererFactory.java
            /cocoon/trunk/blocks/cocoon-fop/cocoon-fop-impl/src/main/java/org/apache/cocoon/serialization/FOPSerializer.java
            /cocoon/trunk/blocks/cocoon-template/cocoon-template-impl/src/main/java/org/apache/cocoon/components/expression/DefaultExpressionFactory.java
            /cocoon/trunk/blocks/cocoon-webdav/cocoon-webdav-impl/src/main/java/org/apache/cocoon/components/webdav/WebDAVUtil.java
            /cocoon/trunk/blocks/cocoon-xsp/cocoon-xsp-impl/src/main/java/org/apache/cocoon/components/language/generator/GeneratorSelector.java
            /cocoon/trunk/blocks/cocoon-xsp/cocoon-xsp-impl/src/main/java/org/apache/cocoon/components/language/programming/java/Jikes.java
            /cocoon/trunk/core/cocoon-core/src/test/java/org/apache/cocoon/environment/mock/MockRequest.java
        
****************************************************************************
Output:
****************************************************************************
[INFO] Scanning for projects...
[INFO] Searching repository for plugin with prefix: 'source'.
[INFO] ----------------------------------------------------------------------------
[INFO] Building Template framework implementation
[INFO]    task-segment: [clean, source:jar, deploy]
[INFO] ----------------------------------------------------------------------------
[INFO] [clean:clean]
[INFO] Deleting directory /home/maven/continuum-1.0.3/apps/continuum/working-directory/137/target
[INFO] [source:jar]
[INFO] Building jar: /home/maven/continuum-1.0.3/apps/continuum/working-directory/137/target/cocoon-template-impl-1.0.0-SNAPSHOT-sources.jar
[INFO] [resources:resources]
[INFO] Using default encoding to copy filtered resources.
[WARNING] 
	Artifact javax.servlet:servlet-api:jar:2.3 retains local scope 'provided' overriding broader
scope 'compile'
	given by a dependency. If this is not intended, modify or remove the local scope.

[WARNING] 
	Artifact junit:junit:jar:3.8.2 retains local scope 'test' overriding broader scope 'compile'
	given by a dependency. If this is not intended, modify or remove the local scope.

[INFO] [compiler:compile]
Compiling 94 source files to /home/maven/continuum-1.0.3/apps/continuum/working-directory/137/target/classes
[INFO] ----------------------------------------------------------------------------
[ERROR] BUILD FAILURE
[INFO] ----------------------------------------------------------------------------
[INFO] Compilation failure

/home/maven/continuum-1.0.3/apps/continuum/working-directory/137/src/main/java/org/apache/cocoon/template/environment/FlowObjectModelHelper.java:[70,80]
incompatible types
found   : java.lang.Object
required: java.util.Map


[INFO] ----------------------------------------------------------------------------
[INFO] For more information, run Maven with the -e switch
[INFO] ----------------------------------------------------------------------------
[INFO] Total time: 17 seconds
[INFO] Finished at: Sat Jun 24 03:21:04 GMT+00:00 2006
[INFO] Final Memory: 6M/22M
[INFO] ----------------------------------------------------------------------------

****************************************************************************



Mime
View raw message