cocoon-dev mailing list archives

Site index · List index
Message view « Date » · « Thread »
Top « Date » · « Thread »
From "continuum@cocoon.zones.apache.org" <contin...@cocoon.zones.apache.org>
Subject [continuum] BUILD SUCCESSFUL: Cocoon Core
Date Mon, 26 Jun 2006 03:24:24 GMT
Online report : http://cocoon.zones.apache.org:12000/continuum/servlet/continuum/target/ProjectBuild.vm/view/ProjectBuild/id/162/buildId/1523
Build statistics:
  State: Ok
  Previous State: Failed
  Started at: Mon, 26 Jun 2006 03:22:24 +0000
  Finished at: Mon, 26 Jun 2006 03:24:24 +0000
  Total time: 1m 59s
  Build Trigger: Schedule
  Exit code: 0
  Building machine hostname: cocoon.zones.apache.org
  Operating system : SunOS(unknown)
  Java version : 1.4.2_06(Sun Microsystems Inc.)

Changes
         cziegeler          Add default includes
             /cocoon/trunk/core/cocoon-core/src/main/java/org/apache/cocoon/components/treeprocessor/sitemap/SitemapLanguage.java
        
****************************************************************************
Output:
****************************************************************************
[INFO] Scanning for projects...
[INFO] Searching repository for plugin with prefix: 'source'.
[INFO] ----------------------------------------------------------------------------
[INFO] Building Cocoon Core
[INFO]    task-segment: [clean, source:jar, deploy]
[INFO] ----------------------------------------------------------------------------
[INFO] [clean:clean]
[INFO] Deleting directory /home/maven/continuum-1.0.3/apps/continuum/working-directory/162/target
[INFO] [source:jar]
[INFO] Building jar: /home/maven/continuum-1.0.3/apps/continuum/working-directory/162/target/cocoon-core-2.2.0-SNAPSHOT-sources.jar
[INFO] [resources:resources]
[INFO] Using default encoding to copy filtered resources.
Downloading: http://mirrors.dotsrc.org/maven2/org/springframework/spring-context/2.0-rc1/spring-context-2.0-rc1.pom
[WARNING] Unable to get resource from repository central (http://ibiblio.org/maven2)
Downloading: http://svn.apache.org/maven-snapshot-repository/org/springframework/spring-context/2.0-rc1/spring-context-2.0-rc1.pom
[WARNING] Unable to get resource from repository apache.snapshot (http://svn.apache.org/maven-snapshot-repository)
Downloading: http://svn.apache.org/repository/org.springframework/poms/spring-context-2.0-rc1.pom
[WARNING] Unable to get resource from repository apache-cvs (http://svn.apache.org/repository)
[WARNING] 
	Artifact junit:junit:jar:3.8.2 retains local scope 'test' overriding broader scope 'compile'
	given by a dependency. If this is not intended, modify or remove the local scope.

[INFO] snapshot org.apache.cocoon:cocoon-bootstrap:1.0.0-SNAPSHOT: checking for updates from
central
[INFO] snapshot org.apache.cocoon:cocoon-bootstrap:1.0.0-SNAPSHOT: checking for updates from
apache.snapshot
[INFO] snapshot org.apache.cocoon:cocoon-bootstrap:1.0.0-SNAPSHOT: checking for updates from
apache-cvs
[INFO] snapshot org.apache.cocoon:cocoon-bootstrap:1.0.0-SNAPSHOT: checking for updates from
apache.snapshots
Downloading: http://mirrors.dotsrc.org/maven2/org/springframework/spring-aop/2.0-rc1/spring-aop-2.0-rc1.pom
[WARNING] Unable to get resource from repository central (http://ibiblio.org/maven2)
Downloading: http://svn.apache.org/maven-snapshot-repository/org/springframework/spring-aop/2.0-rc1/spring-aop-2.0-rc1.pom
[WARNING] Unable to get resource from repository apache.snapshot (http://svn.apache.org/maven-snapshot-repository)
Downloading: http://svn.apache.org/repository/org.springframework/poms/spring-aop-2.0-rc1.pom
[WARNING] Unable to get resource from repository apache-cvs (http://svn.apache.org/repository)
[WARNING] 
	Artifact javax.servlet:servlet-api:jar:2.3 retains local scope 'provided' overriding broader
scope 'compile'
	given by a dependency. If this is not intended, modify or remove the local scope.

Downloading: http://mirrors.dotsrc.org/maven2/org/springframework/spring-web/2.0-rc1/spring-web-2.0-rc1.pom
[WARNING] Unable to get resource from repository central (http://ibiblio.org/maven2)
Downloading: http://svn.apache.org/maven-snapshot-repository/org/springframework/spring-web/2.0-rc1/spring-web-2.0-rc1.pom
[WARNING] Unable to get resource from repository apache.snapshot (http://svn.apache.org/maven-snapshot-repository)
Downloading: http://svn.apache.org/repository/org.springframework/poms/spring-web-2.0-rc1.pom
[WARNING] Unable to get resource from repository apache-cvs (http://svn.apache.org/repository)
Downloading: http://mirrors.dotsrc.org/maven2/org/springframework/spring-core/2.0-rc1/spring-core-2.0-rc1.pom
[WARNING] Unable to get resource from repository central (http://ibiblio.org/maven2)
Downloading: http://svn.apache.org/maven-snapshot-repository/org/springframework/spring-core/2.0-rc1/spring-core-2.0-rc1.pom
[WARNING] Unable to get resource from repository apache.snapshot (http://svn.apache.org/maven-snapshot-repository)
Downloading: http://svn.apache.org/repository/org.springframework/poms/spring-core-2.0-rc1.pom
[WARNING] Unable to get resource from repository apache-cvs (http://svn.apache.org/repository)
[INFO] snapshot org.apache.cocoon:cocoon-licenses:1.0-SNAPSHOT: checking for updates from
central
[INFO] snapshot org.apache.cocoon:cocoon-licenses:1.0-SNAPSHOT: checking for updates from
apache.snapshot
[INFO] snapshot org.apache.cocoon:cocoon-licenses:1.0-SNAPSHOT: checking for updates from
apache-cvs
[INFO] snapshot org.apache.cocoon:cocoon-licenses:1.0-SNAPSHOT: checking for updates from
apache.snapshots
Downloading: http://mirrors.dotsrc.org/maven2/org/springframework/spring-beans/2.0-rc1/spring-beans-2.0-rc1.pom
[WARNING] Unable to get resource from repository central (http://ibiblio.org/maven2)
Downloading: http://svn.apache.org/maven-snapshot-repository/org/springframework/spring-beans/2.0-rc1/spring-beans-2.0-rc1.pom
[WARNING] Unable to get resource from repository apache.snapshot (http://svn.apache.org/maven-snapshot-repository)
Downloading: http://svn.apache.org/repository/org.springframework/poms/spring-beans-2.0-rc1.pom
[WARNING] Unable to get resource from repository apache-cvs (http://svn.apache.org/repository)
[INFO] [compiler:compile]
Compiling 643 source files to /home/maven/continuum-1.0.3/apps/continuum/working-directory/162/target/classes
[INFO] [resources:testResources]
[INFO] Using default encoding to copy filtered resources.
Downloading: http://mirrors.dotsrc.org/maven2/org/apache/cocoon/cocoon-bootstrap/1.0.0-SNAPSHOT/cocoon-bootstrap-1.0.0-20060625.031032-11.pom
[WARNING] Unable to get resource from repository central (http://ibiblio.org/maven2)
Downloading: http://svn.apache.org/maven-snapshot-repository/org/apache/cocoon/cocoon-bootstrap/1.0.0-SNAPSHOT/cocoon-bootstrap-1.0.0-20060625.031032-11.pom
887b downloaded
[INFO] [compiler:testCompile]
Compiling 77 source files to /home/maven/continuum-1.0.3/apps/continuum/working-directory/162/target/test-classes
[INFO] [surefire:test]
[INFO] Surefire report directory: /home/maven/continuum-1.0.3/apps/continuum/working-directory/162/target/surefire-reports

-------------------------------------------------------
 T E S T S
-------------------------------------------------------
Running org.apache.cocoon.matching.RegexpURIMatcherTestCase
log4j:WARN No appenders could be found for logger (org.springframework.core.CollectionFactory).
log4j:WARN Please initialize the log4j system properly.
{2=null, 0=test/foo/bla/end, 1=test/foo/bla/end}
{3=null, 2=end, 0=test/foo/bla/end, 1=test/foo}
Tests run: 1, Failures: 0, Errors: 0, Skipped: 0, Time elapsed: 0.793 sec
Running org.apache.cocoon.xml.SaxBufferTestCase
consuming: 526315.0 documents per second
parsed:17699.0 documents per second
recalling: 769230.0 documents per second
Tests run: 3, Failures: 0, Errors: 0, Skipped: 0, Time elapsed: 0.697 sec
Running org.apache.cocoon.selection.HeaderSelectorTestCase
true
false
true
false
Tests run: 2, Failures: 0, Errors: 0, Skipped: 0, Time elapsed: 0.149 sec
Running org.apache.cocoon.acting.RequestParamActionTestCase
Tests run: 1, Failures: 0, Errors: 0, Skipped: 0, Time elapsed: 0.008 sec
Running org.apache.cocoon.transformation.FilterTransformerTestCase
Tests run: 3, Failures: 0, Errors: 0, Skipped: 0, Time elapsed: 0.32 sec
Running org.apache.cocoon.core.container.util.PropertyHelperTestCase
Tests run: 1, Failures: 0, Errors: 0, Skipped: 0, Time elapsed: 0.006 sec
Running org.apache.cocoon.transformation.XAbstractDOMTransformerTestCase
Tests run: 1, Failures: 0, Errors: 0, Skipped: 0, Time elapsed: 0.017 sec
Running org.apache.cocoon.generation.FileGeneratorTestCase
Tests run: 1, Failures: 0, Errors: 0, Skipped: 0, Time elapsed: 0.038 sec
Running org.apache.cocoon.selection.RegexpHeaderSelectorTestCase
true
false
[WARNING] The specified pattern name "non-defined-name" was not configured in this instance
false
false
false
true
[WARNING] The specified pattern name "non-defined-name" was not configured in this instance
false
Tests run: 2, Failures: 0, Errors: 0, Skipped: 0, Time elapsed: 0.151 sec
Running org.apache.cocoon.util.WildcardMatcherHelperTestCase
Tests run: 32, Failures: 0, Errors: 0, Skipped: 0, Time elapsed: 0.024 sec
Running org.apache.cocoon.components.thread.DefaultRunnableManagerTestCase
Tests run: 11, Failures: 0, Errors: 0, Skipped: 0, Time elapsed: 1.474 sec
Running org.apache.cocoon.selection.HostSelectorTestCase
true
false
false
false
Tests run: 2, Failures: 0, Errors: 0, Skipped: 0, Time elapsed: 0.153 sec
Running org.apache.cocoon.acting.ResourceExistsActionTestCase
Tests run: 2, Failures: 0, Errors: 0, Skipped: 0, Time elapsed: 0.012 sec
Running org.apache.cocoon.transformation.EncodeURLTransformerTestCase
resultDocument
<?xml version="1.0" encoding="UTF-8"?>
<root><x>X</x><a>A</a><a b="c">d</a><a href="x">x</a></root>
inputDocument
<?xml version="1.0" encoding="UTF-8"?>
<root><x>X</x><a>A</a><a b="c">d</a><a href="x">x</a></root>
transformDocument
<?xml version="1.0" encoding="UTF-8"?>
<root><x>X</x><a>A</a><a b="c">d</a><a href="x">x</a></root>
resultDocument
<?xml version="1.0" encoding="UTF-8"?>
<root><x>X</x><a>A</a><a b="c">d</a><a href="x?JSESSIONID=MockSession">x</a><img
src="img/src must not be encoded"/><a href="href must be encoded?JSESSIONID=MockSession"/><form
action="action must be encoded?JSESSIONID=MockSession"/></root>
inputDocument
<?xml version="1.0" encoding="UTF-8"?>
<root><x>X</x><a>A</a><a b="c">d</a><a href="x">x</a><img
src="img/src must not be encoded"/><a href="href must be encoded"/><form action="action
must be encoded"/></root>
transformDocument
<?xml version="1.0" encoding="UTF-8"?>
<root><x>X</x><a>A</a><a b="c">d</a><a href="x?JSESSIONID=MockSession">x</a><img
src="img/src must not be encoded"/><a href="href must be encoded?JSESSIONID=MockSession"/><form
action="action must be encoded?JSESSIONID=MockSession"/></root>
Tests run: 2, Failures: 0, Errors: 0, Skipped: 0, Time elapsed: 0.156 sec
Running org.apache.cocoon.transformation.CIncludeTransformerTestCase
[WARNING] The cinclude transformer cannot find the IncludeCacheManager. Therefore caching
is turned off for the include transformer.
[WARNING] The cinclude transformer cannot find the IncludeCacheManager. Therefore caching
is turned off for the include transformer.
[WARNING] The cinclude transformer cannot find the IncludeCacheManager. Therefore caching
is turned off for the include transformer.
Tests run: 3, Failures: 0, Errors: 0, Skipped: 0, Time elapsed: 0.333 sec
Running org.apache.cocoon.matching.RequestParameterMatcherTestCase
{1=requestParameterMatchTestCaseValue}
Tests run: 2, Failures: 0, Errors: 0, Skipped: 0, Time elapsed: 0.144 sec
Running org.apache.cocoon.util.test.IOUtilsTestCase
Tests run: 2, Failures: 0, Errors: 0, Skipped: 0, Time elapsed: 0.046 sec
Running org.apache.cocoon.util.test.NetUtilsTestCase
Tests run: 8, Failures: 0, Errors: 0, Skipped: 0, Time elapsed: 0.012 sec
Running org.apache.cocoon.selection.RequestAttributeSelectorTestCase
true
false
true
false
Tests run: 2, Failures: 0, Errors: 0, Skipped: 0, Time elapsed: 0.074 sec
Running org.apache.cocoon.components.thread.DefaultThreadPoolTestCase
[DEBUG] Executing Command: EasyMock for interface java.lang.Runnable,pool=mypool
[DEBUG] Executing Command: org.apache.cocoon.components.thread.DefaultThreadPoolTestCase$1@9aba32,pool=mypool
[DEBUG] Executing Command: org.apache.cocoon.components.thread.DefaultThreadPoolTestCase$1@9aba32,pool=mypool
[INFO] runnable runs
[INFO] runnable runs
[WARNING] running commands have not terminated within 100ms. Will shut them down by interruption
[INFO] runnable has been interrupted 
[INFO] runnable has been interrupted 
[INFO] runnable terminated
[INFO] runnable terminated
Tests run: 3, Failures: 0, Errors: 0, Skipped: 0, Time elapsed: 0.641 sec
Running org.apache.cocoon.selection.ParameterSelectorTestCase
false
false
true
false
Tests run: 2, Failures: 0, Errors: 0, Skipped: 0, Time elapsed: 0.082 sec
Running org.apache.cocoon.components.treeprocessor.variables.PreparedVariableResolverTestCase
Tests run: 13, Failures: 0, Errors: 0, Skipped: 0, Time elapsed: 0.535 sec
Running org.apache.cocoon.selection.BrowserSelectorTestCase
[WARNING] No configuration for expression 'non-configured-browser-name' -- failing.
false
true
false
Tests run: 2, Failures: 0, Errors: 0, Skipped: 0, Time elapsed: 0.076 sec
Running org.apache.cocoon.selection.RequestParameterSelectorTestCase
true
false
true
false
Tests run: 2, Failures: 0, Errors: 0, Skipped: 0, Time elapsed: 0.062 sec
Running org.apache.cocoon.selection.SessionAttributeSelectorTestCase
true
false
true
false
false
Tests run: 3, Failures: 0, Errors: 0, Skipped: 0, Time elapsed: 0.09 sec
Running org.apache.cocoon.xml.dom.DOMBuilderTestCase
Tests run: 1, Failures: 0, Errors: 0, Skipped: 0, Time elapsed: 0.007 sec
Running org.apache.cocoon.matching.ParameterMatcherTestCase
{1=parameterMatchTestCaseValue}
Tests run: 2, Failures: 0, Errors: 0, Skipped: 0, Time elapsed: 0.054 sec
Running org.apache.cocoon.transformation.XIncludeTransformerTestCase
[ERROR] xIncluded resource not found: file:/home/maven/continuum-1.0.3/apps/continuum/working-directory/162/this_file_does_not_exist.xml
org.apache.cocoon.ResourceNotFoundException: Resource not found.
	at org.apache.cocoon.components.source.SourceUtil.handle(SourceUtil.java:375)
	at org.apache.cocoon.components.source.SourceUtil.toSAX(SourceUtil.java:188)
	at org.apache.cocoon.components.source.SourceUtil.toSAX(SourceUtil.java:134)
	at org.apache.cocoon.transformation.XIncludeTransformer$XIncludePipe.processXIncludeElement(XIncludeTransformer.java:466)
	at org.apache.cocoon.transformation.XIncludeTransformer$XIncludePipe.startElement(XIncludeTransformer.java:235)
	at org.apache.cocoon.xml.AbstractXMLPipe.startElement(AbstractXMLPipe.java:93)
	at sun.reflect.GeneratedMethodAccessor12.invoke(Unknown Source)
	at sun.reflect.DelegatingMethodAccessorImpl.invoke(DelegatingMethodAccessorImpl.java:25)
	at java.lang.reflect.Method.invoke(Method.java:324)
	at org.apache.cocoon.core.container.spring.PoolableFactoryBean$ProxyHandler.invoke(PoolableFactoryBean.java:340)
	at $Proxy11.startElement(Unknown Source)
	at org.apache.cocoon.xml.dom.DOMStreamer$NamespaceNormalizingDOMStreamer.startNode(DOMStreamer.java:434)
	at org.apache.cocoon.xml.dom.DOMStreamer$NamespaceNormalizingDOMStreamer.stream(DOMStreamer.java:216)
	at org.apache.cocoon.xml.dom.DOMStreamer.stream(DOMStreamer.java:140)
	at org.apache.cocoon.SitemapComponentTestCase.transform(SitemapComponentTestCase.java:403)
	at org.apache.cocoon.transformation.XIncludeTransformerTestCase.xincludeTest(XIncludeTransformerTestCase.java:39)
	at org.apache.cocoon.transformation.XIncludeTransformerTestCase.testXIncludeSimpleFallback(XIncludeTransformerTestCase.java:68)
	at sun.reflect.NativeMethodAccessorImpl.invoke0(Native Method)
	at sun.reflect.NativeMethodAccessorImpl.invoke(NativeMethodAccessorImpl.java:39)
	at sun.reflect.DelegatingMethodAccessorImpl.invoke(DelegatingMethodAccessorImpl.java:25)
	at java.lang.reflect.Method.invoke(Method.java:324)
	at junit.framework.TestCase.runTest(TestCase.java:164)
	at junit.framework.TestCase.runBare(TestCase.java:130)
	at junit.framework.TestResult$1.protect(TestResult.java:106)
	at junit.framework.TestResult.runProtected(TestResult.java:124)
	at junit.framework.TestResult.run(TestResult.java:109)
	at junit.framework.TestCase.run(TestCase.java:120)
	at junit.framework.TestSuite.runTest(TestSuite.java:230)
	at junit.framework.TestSuite.run(TestSuite.java:225)
	at sun.reflect.GeneratedMethodAccessor11.invoke(Unknown Source)
	at sun.reflect.DelegatingMethodAccessorImpl.invoke(DelegatingMethodAccessorImpl.java:25)
	at java.lang.reflect.Method.invoke(Method.java:324)
	at org.apache.maven.surefire.junit.JUnitTestSet.execute(JUnitTestSet.java:210)
	at org.apache.maven.surefire.suite.AbstractDirectoryTestSuite.executeTestSet(AbstractDirectoryTestSuite.java:135)
	at org.apache.maven.surefire.suite.AbstractDirectoryTestSuite.execute(AbstractDirectoryTestSuite.java:122)
	at org.apache.maven.surefire.Surefire.run(Surefire.java:129)
	at sun.reflect.NativeMethodAccessorImpl.invoke0(Native Method)
	at sun.reflect.NativeMethodAccessorImpl.invoke(NativeMethodAccessorImpl.java:39)
	at sun.reflect.DelegatingMethodAccessorImpl.invoke(DelegatingMethodAccessorImpl.java:25)
	at java.lang.reflect.Method.invoke(Method.java:324)
	at org.apache.maven.surefire.booter.SurefireBooter.runSuitesInProcess(SurefireBooter.java:225)
	at org.apache.maven.surefire.booter.SurefireBooter.main(SurefireBooter.java:747)
Caused by: org.apache.excalibur.source.SourceNotFoundException: file:/home/maven/continuum-1.0.3/apps/continuum/working-directory/162/this_file_does_not_exist.xml
doesn't exist.
	at org.apache.excalibur.source.impl.FileSource.getInputStream(FileSource.java:150)
	at org.apache.cocoon.components.source.SourceUtil.toSAX(SourceUtil.java:183)
	... 40 more
Caused by: java.io.FileNotFoundException: /home/maven/continuum-1.0.3/apps/continuum/working-directory/162/this_file_does_not_exist.xml
(No such file or directory)
	at java.io.FileInputStream.open(Native Method)
	at java.io.FileInputStream.<init>(FileInputStream.java:106)
	at org.apache.excalibur.source.impl.FileSource.getInputStream(FileSource.java:146)
	... 41 more
[ERROR] xIncluded resource not found: file:/home/maven/continuum-1.0.3/apps/continuum/working-directory/162/this_file_does_not_exist.xml
org.apache.cocoon.ResourceNotFoundException: Resource not found.
	at org.apache.cocoon.components.source.SourceUtil.handle(SourceUtil.java:375)
	at org.apache.cocoon.components.source.SourceUtil.toSAX(SourceUtil.java:188)
	at org.apache.cocoon.components.source.SourceUtil.toSAX(SourceUtil.java:134)
	at org.apache.cocoon.transformation.XIncludeTransformer$XIncludePipe.processXIncludeElement(XIncludeTransformer.java:466)
	at org.apache.cocoon.transformation.XIncludeTransformer$XIncludePipe.startElement(XIncludeTransformer.java:235)
	at org.apache.cocoon.xml.AbstractXMLPipe.startElement(AbstractXMLPipe.java:93)
	at sun.reflect.GeneratedMethodAccessor12.invoke(Unknown Source)
	at sun.reflect.DelegatingMethodAccessorImpl.invoke(DelegatingMethodAccessorImpl.java:25)
	at java.lang.reflect.Method.invoke(Method.java:324)
	at org.apache.cocoon.core.container.spring.PoolableFactoryBean$ProxyHandler.invoke(PoolableFactoryBean.java:340)
	at $Proxy11.startElement(Unknown Source)
	at org.apache.cocoon.xml.dom.DOMStreamer$NamespaceNormalizingDOMStreamer.startNode(DOMStreamer.java:434)
	at org.apache.cocoon.xml.dom.DOMStreamer$NamespaceNormalizingDOMStreamer.stream(DOMStreamer.java:216)
	at org.apache.cocoon.xml.dom.DOMStreamer.stream(DOMStreamer.java:140)
	at org.apache.cocoon.SitemapComponentTestCase.transform(SitemapComponentTestCase.java:403)
	at org.apache.cocoon.transformation.XIncludeTransformerTestCase.xincludeTest(XIncludeTransformerTestCase.java:39)
	at org.apache.cocoon.transformation.XIncludeTransformerTestCase.testXIncludeNestedXincludeElementInAFallback(XIncludeTransformerTestCase.java:79)
	at sun.reflect.NativeMethodAccessorImpl.invoke0(Native Method)
	at sun.reflect.NativeMethodAccessorImpl.invoke(NativeMethodAccessorImpl.java:39)
	at sun.reflect.DelegatingMethodAccessorImpl.invoke(DelegatingMethodAccessorImpl.java:25)
	at java.lang.reflect.Method.invoke(Method.java:324)
	at junit.framework.TestCase.runTest(TestCase.java:164)
	at junit.framework.TestCase.runBare(TestCase.java:130)
	at junit.framework.TestResult$1.protect(TestResult.java:106)
	at junit.framework.TestResult.runProtected(TestResult.java:124)
	at junit.framework.TestResult.run(TestResult.java:109)
	at junit.framework.TestCase.run(TestCase.java:120)
	at junit.framework.TestSuite.runTest(TestSuite.java:230)
	at junit.framework.TestSuite.run(TestSuite.java:225)
	at sun.reflect.GeneratedMethodAccessor11.invoke(Unknown Source)
	at sun.reflect.DelegatingMethodAccessorImpl.invoke(DelegatingMethodAccessorImpl.java:25)
	at java.lang.reflect.Method.invoke(Method.java:324)
	at org.apache.maven.surefire.junit.JUnitTestSet.execute(JUnitTestSet.java:210)
	at org.apache.maven.surefire.suite.AbstractDirectoryTestSuite.executeTestSet(AbstractDirectoryTestSuite.java:135)
	at org.apache.maven.surefire.suite.AbstractDirectoryTestSuite.execute(AbstractDirectoryTestSuite.java:122)
	at org.apache.maven.surefire.Surefire.run(Surefire.java:129)
	at sun.reflect.NativeMethodAccessorImpl.invoke0(Native Method)
	at sun.reflect.NativeMethodAccessorImpl.invoke(NativeMethodAccessorImpl.java:39)
	at sun.reflect.DelegatingMethodAccessorImpl.invoke(DelegatingMethodAccessorImpl.java:25)
	at java.lang.reflect.Method.invoke(Method.java:324)
	at org.apache.maven.surefire.booter.SurefireBooter.runSuitesInProcess(SurefireBooter.java:225)
	at org.apache.maven.surefire.booter.SurefireBooter.main(SurefireBooter.java:747)
Caused by: org.apache.excalibur.source.SourceNotFoundException: file:/home/maven/continuum-1.0.3/apps/continuum/working-directory/162/this_file_does_not_exist.xml
doesn't exist.
	at org.apache.excalibur.source.impl.FileSource.getInputStream(FileSource.java:150)
	at org.apache.cocoon.components.source.SourceUtil.toSAX(SourceUtil.java:183)
	... 40 more
Caused by: java.io.FileNotFoundException: /home/maven/continuum-1.0.3/apps/continuum/working-directory/162/this_file_does_not_exist.xml
(No such file or directory)
	at java.io.FileInputStream.open(Native Method)
	at java.io.FileInputStream.<init>(FileInputStream.java:106)
	at org.apache.excalibur.source.impl.FileSource.getInputStream(FileSource.java:146)
	... 41 more
[ERROR] xIncluded resource not found: file:/home/maven/continuum-1.0.3/apps/continuum/working-directory/162/this_file_does_not_exist.xml
org.apache.cocoon.ResourceNotFoundException: Resource not found.
	at org.apache.cocoon.components.source.SourceUtil.handle(SourceUtil.java:375)
	at org.apache.cocoon.components.source.SourceUtil.toSAX(SourceUtil.java:188)
	at org.apache.cocoon.components.source.SourceUtil.toSAX(SourceUtil.java:134)
	at org.apache.cocoon.transformation.XIncludeTransformer$XIncludePipe.processXIncludeElement(XIncludeTransformer.java:466)
	at org.apache.cocoon.transformation.XIncludeTransformer$XIncludePipe.startElement(XIncludeTransformer.java:235)
	at org.apache.cocoon.xml.AbstractXMLPipe.startElement(AbstractXMLPipe.java:93)
	at sun.reflect.GeneratedMethodAccessor12.invoke(Unknown Source)
	at sun.reflect.DelegatingMethodAccessorImpl.invoke(DelegatingMethodAccessorImpl.java:25)
	at java.lang.reflect.Method.invoke(Method.java:324)
	at org.apache.cocoon.core.container.spring.PoolableFactoryBean$ProxyHandler.invoke(PoolableFactoryBean.java:340)
	at $Proxy11.startElement(Unknown Source)
	at org.apache.cocoon.xml.dom.DOMStreamer$NamespaceNormalizingDOMStreamer.startNode(DOMStreamer.java:434)
	at org.apache.cocoon.xml.dom.DOMStreamer$NamespaceNormalizingDOMStreamer.stream(DOMStreamer.java:216)
	at org.apache.cocoon.xml.dom.DOMStreamer.stream(DOMStreamer.java:140)
	at org.apache.cocoon.SitemapComponentTestCase.transform(SitemapComponentTestCase.java:403)
	at org.apache.cocoon.transformation.XIncludeTransformerTestCase.xincludeTest(XIncludeTransformerTestCase.java:39)
	at org.apache.cocoon.transformation.XIncludeTransformerTestCase.testXIncludeMultipleNestedFallback(XIncludeTransformerTestCase.java:88)
	at sun.reflect.NativeMethodAccessorImpl.invoke0(Native Method)
	at sun.reflect.NativeMethodAccessorImpl.invoke(NativeMethodAccessorImpl.java:39)
	at sun.reflect.DelegatingMethodAccessorImpl.invoke(DelegatingMethodAccessorImpl.java:25)
	at java.lang.reflect.Method.invoke(Method.java:324)
	at junit.framework.TestCase.runTest(TestCase.java:164)
	at junit.framework.TestCase.runBare(TestCase.java:130)
	at junit.framework.TestResult$1.protect(TestResult.java:106)
	at junit.framework.TestResult.runProtected(TestResult.java:124)
	at junit.framework.TestResult.run(TestResult.java:109)
	at junit.framework.TestCase.run(TestCase.java:120)
	at junit.framework.TestSuite.runTest(TestSuite.java:230)
	at junit.framework.TestSuite.run(TestSuite.java:225)
	at sun.reflect.GeneratedMethodAccessor11.invoke(Unknown Source)
	at sun.reflect.DelegatingMethodAccessorImpl.invoke(DelegatingMethodAccessorImpl.java:25)
	at java.lang.reflect.Method.invoke(Method.java:324)
	at org.apache.maven.surefire.junit.JUnitTestSet.execute(JUnitTestSet.java:210)
	at org.apache.maven.surefire.suite.AbstractDirectoryTestSuite.executeTestSet(AbstractDirectoryTestSuite.java:135)
	at org.apache.maven.surefire.suite.AbstractDirectoryTestSuite.execute(AbstractDirectoryTestSuite.java:122)
	at org.apache.maven.surefire.Surefire.run(Surefire.java:129)
	at sun.reflect.NativeMethodAccessorImpl.invoke0(Native Method)
	at sun.reflect.NativeMethodAccessorImpl.invoke(NativeMethodAccessorImpl.java:39)
	at sun.reflect.DelegatingMethodAccessorImpl.invoke(DelegatingMethodAccessorImpl.java:25)
	at java.lang.reflect.Method.invoke(Method.java:324)
	at org.apache.maven.surefire.booter.SurefireBooter.runSuitesInProcess(SurefireBooter.java:225)
	at org.apache.maven.surefire.booter.SurefireBooter.main(SurefireBooter.java:747)
Caused by: org.apache.excalibur.source.SourceNotFoundException: file:/home/maven/continuum-1.0.3/apps/continuum/working-directory/162/this_file_does_not_exist.xml
doesn't exist.
	at org.apache.excalibur.source.impl.FileSource.getInputStream(FileSource.java:150)
	at org.apache.cocoon.components.source.SourceUtil.toSAX(SourceUtil.java:183)
	... 40 more
Caused by: java.io.FileNotFoundException: /home/maven/continuum-1.0.3/apps/continuum/working-directory/162/this_file_does_not_exist.xml
(No such file or directory)
	at java.io.FileInputStream.open(Native Method)
	at java.io.FileInputStream.<init>(FileInputStream.java:106)
	at org.apache.excalibur.source.impl.FileSource.getInputStream(FileSource.java:146)
	... 41 more
[ERROR] xIncluded resource not found: file:/home/maven/continuum-1.0.3/apps/continuum/working-directory/162/neither_does_this.xml
org.apache.cocoon.ResourceNotFoundException: Resource not found.
	at org.apache.cocoon.components.source.SourceUtil.handle(SourceUtil.java:375)
	at org.apache.cocoon.components.source.SourceUtil.toSAX(SourceUtil.java:188)
	at org.apache.cocoon.components.source.SourceUtil.toSAX(SourceUtil.java:134)
	at org.apache.cocoon.transformation.XIncludeTransformer$XIncludePipe.processXIncludeElement(XIncludeTransformer.java:466)
	at org.apache.cocoon.transformation.XIncludeTransformer$XIncludePipe.startElement(XIncludeTransformer.java:235)
	at org.apache.cocoon.xml.AbstractXMLPipe.startElement(AbstractXMLPipe.java:93)
	at sun.reflect.GeneratedMethodAccessor12.invoke(Unknown Source)
	at sun.reflect.DelegatingMethodAccessorImpl.invoke(DelegatingMethodAccessorImpl.java:25)
	at java.lang.reflect.Method.invoke(Method.java:324)
	at org.apache.cocoon.core.container.spring.PoolableFactoryBean$ProxyHandler.invoke(PoolableFactoryBean.java:340)
	at $Proxy11.startElement(Unknown Source)
	at org.apache.cocoon.xml.dom.DOMStreamer$NamespaceNormalizingDOMStreamer.startNode(DOMStreamer.java:434)
	at org.apache.cocoon.xml.dom.DOMStreamer$NamespaceNormalizingDOMStreamer.stream(DOMStreamer.java:216)
	at org.apache.cocoon.xml.dom.DOMStreamer.stream(DOMStreamer.java:140)
	at org.apache.cocoon.SitemapComponentTestCase.transform(SitemapComponentTestCase.java:403)
	at org.apache.cocoon.transformation.XIncludeTransformerTestCase.xincludeTest(XIncludeTransformerTestCase.java:39)
	at org.apache.cocoon.transformation.XIncludeTransformerTestCase.testXIncludeMultipleNestedFallback(XIncludeTransformerTestCase.java:88)
	at sun.reflect.NativeMethodAccessorImpl.invoke0(Native Method)
	at sun.reflect.NativeMethodAccessorImpl.invoke(NativeMethodAccessorImpl.java:39)
	at sun.reflect.DelegatingMethodAccessorImpl.invoke(DelegatingMethodAccessorImpl.java:25)
	at java.lang.reflect.Method.invoke(Method.java:324)
	at junit.framework.TestCase.runTest(TestCase.java:164)
	at junit.framework.TestCase.runBare(TestCase.java:130)
	at junit.framework.TestResult$1.protect(TestResult.java:106)
	at junit.framework.TestResult.runProtected(TestResult.java:124)
	at junit.framework.TestResult.run(TestResult.java:109)
	at junit.framework.TestCase.run(TestCase.java:120)
	at junit.framework.TestSuite.runTest(TestSuite.java:230)
	at junit.framework.TestSuite.run(TestSuite.java:225)
	at sun.reflect.GeneratedMethodAccessor11.invoke(Unknown Source)
	at sun.reflect.DelegatingMethodAccessorImpl.invoke(DelegatingMethodAccessorImpl.java:25)
	at java.lang.reflect.Method.invoke(Method.java:324)
	at org.apache.maven.surefire.junit.JUnitTestSet.execute(JUnitTestSet.java:210)
	at org.apache.maven.surefire.suite.AbstractDirectoryTestSuite.executeTestSet(AbstractDirectoryTestSuite.java:135)
	at org.apache.maven.surefire.suite.AbstractDirectoryTestSuite.execute(AbstractDirectoryTestSuite.java:122)
	at org.apache.maven.surefire.Surefire.run(Surefire.java:129)
	at sun.reflect.NativeMethodAccessorImpl.invoke0(Native Method)
	at sun.reflect.NativeMethodAccessorImpl.invoke(NativeMethodAccessorImpl.java:39)
	at sun.reflect.DelegatingMethodAccessorImpl.invoke(DelegatingMethodAccessorImpl.java:25)
	at java.lang.reflect.Method.invoke(Method.java:324)
	at org.apache.maven.surefire.booter.SurefireBooter.runSuitesInProcess(SurefireBooter.java:225)
	at org.apache.maven.surefire.booter.SurefireBooter.main(SurefireBooter.java:747)
Caused by: org.apache.excalibur.source.SourceNotFoundException: file:/home/maven/continuum-1.0.3/apps/continuum/working-directory/162/neither_does_this.xml
doesn't exist.
	at org.apache.excalibur.source.impl.FileSource.getInputStream(FileSource.java:150)
	at org.apache.cocoon.components.source.SourceUtil.toSAX(SourceUtil.java:183)
	... 40 more
Caused by: java.io.FileNotFoundException: /home/maven/continuum-1.0.3/apps/continuum/working-directory/162/neither_does_this.xml
(No such file or directory)
	at java.io.FileInputStream.open(Native Method)
	at java.io.FileInputStream.<init>(FileInputStream.java:106)
	at org.apache.excalibur.source.impl.FileSource.getInputStream(FileSource.java:146)
	... 41 more
[ERROR] xIncluded resource not found: file:/home/maven/continuum-1.0.3/apps/continuum/working-directory/162/this_file_does_not_exist.txt
org.apache.excalibur.source.SourceNotFoundException: file:/home/maven/continuum-1.0.3/apps/continuum/working-directory/162/this_file_does_not_exist.txt
doesn't exist.
	at org.apache.excalibur.source.impl.FileSource.getInputStream(FileSource.java:150)
	at org.apache.cocoon.transformation.XIncludeTransformer$XIncludePipe.processXIncludeElement(XIncludeTransformer.java:428)
	at org.apache.cocoon.transformation.XIncludeTransformer$XIncludePipe.startElement(XIncludeTransformer.java:235)
	at org.apache.cocoon.xml.AbstractXMLPipe.startElement(AbstractXMLPipe.java:93)
	at sun.reflect.GeneratedMethodAccessor12.invoke(Unknown Source)
	at sun.reflect.DelegatingMethodAccessorImpl.invoke(DelegatingMethodAccessorImpl.java:25)
	at java.lang.reflect.Method.invoke(Method.java:324)
	at org.apache.cocoon.core.container.spring.PoolableFactoryBean$ProxyHandler.invoke(PoolableFactoryBean.java:340)
	at $Proxy11.startElement(Unknown Source)
	at org.apache.cocoon.xml.dom.DOMStreamer$NamespaceNormalizingDOMStreamer.startNode(DOMStreamer.java:434)
	at org.apache.cocoon.xml.dom.DOMStreamer$NamespaceNormalizingDOMStreamer.stream(DOMStreamer.java:216)
	at org.apache.cocoon.xml.dom.DOMStreamer.stream(DOMStreamer.java:140)
	at org.apache.cocoon.SitemapComponentTestCase.transform(SitemapComponentTestCase.java:403)
	at org.apache.cocoon.transformation.XIncludeTransformerTestCase.xincludeTest(XIncludeTransformerTestCase.java:39)
	at org.apache.cocoon.transformation.XIncludeTransformerTestCase.testXIncludeSimpleFallbackForTextParse(XIncludeTransformerTestCase.java:99)
	at sun.reflect.NativeMethodAccessorImpl.invoke0(Native Method)
	at sun.reflect.NativeMethodAccessorImpl.invoke(NativeMethodAccessorImpl.java:39)
	at sun.reflect.DelegatingMethodAccessorImpl.invoke(DelegatingMethodAccessorImpl.java:25)
	at java.lang.reflect.Method.invoke(Method.java:324)
	at junit.framework.TestCase.runTest(TestCase.java:164)
	at junit.framework.TestCase.runBare(TestCase.java:130)
	at junit.framework.TestResult$1.protect(TestResult.java:106)
	at junit.framework.TestResult.runProtected(TestResult.java:124)
	at junit.framework.TestResult.run(TestResult.java:109)
	at junit.framework.TestCase.run(TestCase.java:120)
	at junit.framework.TestSuite.runTest(TestSuite.java:230)
	at junit.framework.TestSuite.run(TestSuite.java:225)
	at sun.reflect.GeneratedMethodAccessor11.invoke(Unknown Source)
	at sun.reflect.DelegatingMethodAccessorImpl.invoke(DelegatingMethodAccessorImpl.java:25)
	at java.lang.reflect.Method.invoke(Method.java:324)
	at org.apache.maven.surefire.junit.JUnitTestSet.execute(JUnitTestSet.java:210)
	at org.apache.maven.surefire.suite.AbstractDirectoryTestSuite.executeTestSet(AbstractDirectoryTestSuite.java:135)
	at org.apache.maven.surefire.suite.AbstractDirectoryTestSuite.execute(AbstractDirectoryTestSuite.java:122)
	at org.apache.maven.surefire.Surefire.run(Surefire.java:129)
	at sun.reflect.NativeMethodAccessorImpl.invoke0(Native Method)
	at sun.reflect.NativeMethodAccessorImpl.invoke(NativeMethodAccessorImpl.java:39)
	at sun.reflect.DelegatingMethodAccessorImpl.invoke(DelegatingMethodAccessorImpl.java:25)
	at java.lang.reflect.Method.invoke(Method.java:324)
	at org.apache.maven.surefire.booter.SurefireBooter.runSuitesInProcess(SurefireBooter.java:225)
	at org.apache.maven.surefire.booter.SurefireBooter.main(SurefireBooter.java:747)
Caused by: java.io.FileNotFoundException: /home/maven/continuum-1.0.3/apps/continuum/working-directory/162/this_file_does_not_exist.txt
(No such file or directory)
	at java.io.FileInputStream.open(Native Method)
	at java.io.FileInputStream.<init>(FileInputStream.java:106)
	at org.apache.excalibur.source.impl.FileSource.getInputStream(FileSource.java:146)
	... 39 more
Tests run: 6, Failures: 0, Errors: 0, Skipped: 0, Time elapsed: 0.45 sec
Running org.apache.cocoon.components.sax.XMLByteStreamCompilerInterpreterTestCase
consuming: 344827.0 documents per second
parsed: 22371.0 documents per second
recalling: 256410.0 documents per second
Tests run: 4, Failures: 0, Errors: 0, Skipped: 0, Time elapsed: 0.649 sec
Running org.apache.cocoon.xml.NamespacesTableTestCase
Tests run: 6, Failures: 0, Errors: 0, Skipped: 0, Time elapsed: 0.016 sec
Running org.apache.cocoon.selection.CookieSelectorTestCase
true
false
true
false
Tests run: 2, Failures: 0, Errors: 0, Skipped: 0, Time elapsed: 0.064 sec
Running org.apache.cocoon.xml.dom.DOMBuilderStreamerTestCase
<?xml version="1.0" encoding="UTF-8"?>
<root/>
<?xml version="1.0" encoding="UTF-8"?>
<!--abcd--><root/>
Tests run: 7, Failures: 0, Errors: 0, Skipped: 0, Time elapsed: 0.043 sec
Running org.apache.cocoon.selection.SimpleSelectorTestCase
true
false
false
false
Tests run: 2, Failures: 0, Errors: 0, Skipped: 0, Time elapsed: 0.075 sec
Running org.apache.cocoon.matching.RequestAttributeMatcherTestCase
{1=requestAttributeMatchTestCaseValue}
Tests run: 2, Failures: 0, Errors: 0, Skipped: 0, Time elapsed: 0.065 sec
Running org.apache.cocoon.transformation.TraxTransformerTestCase
Tests run: 2, Failures: 0, Errors: 0, Skipped: 0, Time elapsed: 1.633 sec
Running org.apache.cocoon.matching.SessionAttributeMatcherTestCase
{1=sessionAttributeMatchTestCaseValue}
Tests run: 2, Failures: 0, Errors: 0, Skipped: 0, Time elapsed: 0.057 sec
Running org.apache.cocoon.selection.ExceptionSelectorTestCase
true
false
false
true
false
true
Tests run: 4, Failures: 0, Errors: 0, Skipped: 0, Time elapsed: 0.108 sec
Running org.apache.cocoon.transformation.I18NTransformerTestCase
Tests run: 2, Failures: 0, Errors: 0, Skipped: 0, Time elapsed: 0.158 sec
Running org.apache.cocoon.util.test.MIMEUtilsTestCase
Tests run: 1, Failures: 0, Errors: 0, Skipped: 0, Time elapsed: 0.007 sec
Running org.apache.cocoon.acting.LocaleActionTestCase
Tests run: 2, Failures: 0, Errors: 0, Skipped: 0, Time elapsed: 0.066 sec
Running org.apache.cocoon.selection.RegexpRequestParameterSelectorTestCase
true
false
[WARNING] The specified pattern name "non-defined-name" was not configured in this instance
false
false
true
[WARNING] The specified pattern name "non-defined-name" was not configured in this instance
false
Tests run: 2, Failures: 0, Errors: 0, Skipped: 0, Time elapsed: 0.068 sec
Running org.apache.cocoon.matching.HeaderMatcherTestCase
{1=headerMatchTestCaseValue}
Tests run: 2, Failures: 0, Errors: 0, Skipped: 0, Time elapsed: 0.049 sec
Running org.apache.cocoon.selection.RequestMethodSelectorTestCase
true
false
false
Tests run: 1, Failures: 0, Errors: 0, Skipped: 0, Time elapsed: 0.034 sec
Running org.apache.cocoon.util.test.DeprecationTestCase
Tests run: 8, Failures: 0, Errors: 0, Skipped: 0, Time elapsed: 0.013 sec
Running org.apache.cocoon.matching.WildcardURIMatcherTestCase
Tests run: 3, Failures: 0, Errors: 0, Skipped: 0, Time elapsed: 0.087 sec
Running org.apache.cocoon.components.thread.DefaultThreadFactoryTestCase
Tests run: 5, Failures: 0, Errors: 0, Skipped: 0, Time elapsed: 0.01 sec
Running org.apache.cocoon.selection.ResourceExistsSelectorTestCase
true
false
true
false
Tests run: 2, Failures: 0, Errors: 0, Skipped: 0, Time elapsed: 0.053 sec
Running org.apache.cocoon.util.location.LocationTestCase
Tests run: 3, Failures: 0, Errors: 0, Skipped: 0, Time elapsed: 0.021 sec
Running org.apache.cocoon.transformation.AugmentTransformerTestCase
resultDocument
<?xml version="1.0" encoding="UTF-8"?>
<root><x>X</x><a>A</a><a b="c">d</a><a href="http://nullnull/portal1/sect1/x">x</a></root>
inputDocument
<?xml version="1.0" encoding="UTF-8"?>
<root><x>X</x><a>A</a><a b="c">d</a><a href="x">x</a></root>
transformDocument
<?xml version="1.0" encoding="UTF-8"?>
<root><x>X</x><a>A</a><a b="c">d</a><a href="http://nullnull/portal1/sect1/x">x</a></root>
Tests run: 1, Failures: 0, Errors: 0, Skipped: 0, Time elapsed: 0.088 sec
Running org.apache.cocoon.environment.commandline.test.CommandLineContextTestCase
Tests run: 3, Failures: 0, Errors: 0, Skipped: 0, Time elapsed: 0.01 sec
Running org.apache.cocoon.matching.CookieMatcherTestCase
{1=cookieValue}
null
Tests run: 2, Failures: 0, Errors: 0, Skipped: 0, Time elapsed: 0.057 sec

Results :
Tests run: 183, Failures: 0, Errors: 0, Skipped: 0

[INFO] [jar:jar]
[INFO] Building jar: /home/maven/continuum-1.0.3/apps/continuum/working-directory/162/target/cocoon-core-2.2.0-SNAPSHOT.jar
[INFO] [jar:test-jar {execution: default}]
[INFO] Building jar: /home/maven/continuum-1.0.3/apps/continuum/working-directory/162/target/cocoon-core-2.2.0-SNAPSHOT-tests.jar
[INFO] [install:install]
[INFO] Installing /home/maven/continuum-1.0.3/apps/continuum/working-directory/162/target/cocoon-core-2.2.0-SNAPSHOT.jar
to /home/maven/.m2/repository/org/apache/cocoon/cocoon-core/2.2.0-SNAPSHOT/cocoon-core-2.2.0-SNAPSHOT.jar
[INFO] Installing /home/maven/continuum-1.0.3/apps/continuum/working-directory/162/target/cocoon-core-2.2.0-SNAPSHOT-sources.jar
to /home/maven/.m2/repository/org/apache/cocoon/cocoon-core/2.2.0-SNAPSHOT/cocoon-core-2.2.0-SNAPSHOT-sources.jar
[INFO] Installing /home/maven/continuum-1.0.3/apps/continuum/working-directory/162/target/cocoon-core-2.2.0-SNAPSHOT-tests.jar
to /home/maven/.m2/repository/org/apache/cocoon/cocoon-core/2.2.0-SNAPSHOT/cocoon-core-2.2.0-SNAPSHOT-tests.jar
[INFO] [deploy:deploy]
[INFO] Retrieving previous build number from apache-maven-snapshot
Uploading: scpexe://people.apache.org/x1/www/cvs.apache.org/maven-snapshot-repository/org/apache/cocoon/cocoon-core/2.2.0-SNAPSHOT/cocoon-core-2.2.0-20060626.032322-23.jar
[INFO] Retrieving previous metadata from apache-maven-snapshot
[INFO] Uploading repository metadata for: 'snapshot org.apache.cocoon:cocoon-core:2.2.0-SNAPSHOT'
[INFO] Retrieving previous metadata from apache-maven-snapshot
[INFO] Uploading repository metadata for: 'artifact org.apache.cocoon:cocoon-core'
[INFO] Retrieving previous metadata from apache-maven-snapshot
[INFO] Uploading project information for cocoon-core 2.2.0-20060626.032322-23
[INFO] Retrieving previous build number from apache-maven-snapshot
Uploading: scpexe://people.apache.org/x1/www/cvs.apache.org/maven-snapshot-repository/org/apache/cocoon/cocoon-core/2.2.0-SNAPSHOT/cocoon-core-2.2.0-20060626.032322-23-sources.jar
[INFO] Retrieving previous build number from apache-maven-snapshot
Uploading: scpexe://people.apache.org/x1/www/cvs.apache.org/maven-snapshot-repository/org/apache/cocoon/cocoon-core/2.2.0-SNAPSHOT/cocoon-core-2.2.0-20060626.032322-23-tests.jar
[INFO] ----------------------------------------------------------------------------
[INFO] BUILD SUCCESSFUL
[INFO] ----------------------------------------------------------------------------
[INFO] Total time: 1 minute 58 seconds
[INFO] Finished at: Mon Jun 26 03:24:23 GMT+00:00 2006
[INFO] Final Memory: 8M/42M
[INFO] ----------------------------------------------------------------------------

****************************************************************************



Mime
View raw message