cocoon-dev mailing list archives

Site index · List index
Message view « Date » · « Thread »
Top « Date » · « Thread »
From "continuum@cocoon.zones.apache.org" <contin...@cocoon.zones.apache.org>
Subject [continuum] BUILD FAILURE: Cocoon Bootstrap Implementation
Date Sat, 24 Jun 2006 03:13:20 GMT
Online report : http://cocoon.zones.apache.org:12000/continuum/servlet/continuum/target/ProjectBuild.vm/view/ProjectBuild/id/176/buildId/1496
Build statistics:
  State: Failed
  Previous State: Ok
  Started at: Sat, 24 Jun 2006 03:13:14 +0000
  Finished at: Sat, 24 Jun 2006 03:13:20 +0000
  Total time: 5s
  Build Trigger: Schedule
  Exit code: 1
  Building machine hostname: cocoon.zones.apache.org
  Operating system : SunOS(unknown)
  Java version : 1.4.2_06(Sun Microsystems Inc.)

Changes
         cziegeler          Switching to new wildcard matching
             /cocoon/trunk/blocks/cocoon-portal/cocoon-portal-impl/src/main/java/org/apache/cocoon/portal/tools/service/UserRightsService.java
            /cocoon/trunk/blocks/cocoon-scratchpad/cocoon-scratchpad-impl/src/main/java/org/apache/cocoon/components/flow/javascript/fom/JavaScriptAspectWeaver.java
            /cocoon/trunk/core/cocoon-bootstrap/src/main/java/org/apache/cocoon/classloader/DefaultClassLoader.java
            /cocoon/trunk/core/cocoon-bootstrap/src/main/java/org/apache/cocoon/classloader/WildcardHelper.java
            /cocoon/trunk/core/cocoon-bootstrap/src/main/java/org/apache/cocoon/classloader/WildcardMatcherHelper.java
            /cocoon/trunk/core/cocoon-core/src/main/java/org/apache/cocoon/bean/CocoonBean.java
            /cocoon/trunk/core/cocoon-core/src/main/java/org/apache/cocoon/core/CoreUtil.java
            /cocoon/trunk/core/cocoon-core/src/main/java/org/apache/cocoon/core/container/spring/ConfigReader.java
            /cocoon/trunk/core/cocoon-core/src/main/java/org/apache/cocoon/matching/AbstractWildcardMatcher.java
            /cocoon/trunk/core/cocoon-core/src/main/java/org/apache/cocoon/matching/helpers/WildcardHelper.java
            /cocoon/trunk/core/cocoon-core/src/main/java/org/apache/cocoon/util/WildcardHelper.java
            /cocoon/trunk/core/cocoon-core/src/test/java/org/apache/cocoon/util/test/WildcardHelperTestCase.java
           cziegeler          Merge with latest changes
             /cocoon/trunk/core/cocoon-bootstrap/src/main/java/org/apache/cocoon/classloader/WildcardMatcherHelper.java
           giacomo          more fixes (why is this one duplicated here?)
             /cocoon/trunk/core/cocoon-bootstrap/src/main/java/org/apache/cocoon/classloader/WildcardMatcherHelper.java
        
****************************************************************************
Output:
****************************************************************************
[INFO] Scanning for projects...
[INFO] Searching repository for plugin with prefix: 'source'.
[INFO] ----------------------------------------------------------------------------
[INFO] Building Cocoon Bootstrap Implementation
[INFO]    task-segment: [clean, source:jar, deploy]
[INFO] ----------------------------------------------------------------------------
[INFO] [clean:clean]
[INFO] Deleting directory /home/maven/continuum-1.0.3/apps/continuum/working-directory/176/target
[INFO] [source:jar]
[INFO] Building jar: /home/maven/continuum-1.0.3/apps/continuum/working-directory/176/target/cocoon-bootstrap-1.0.0-SNAPSHOT-sources.jar
[INFO] [resources:resources]
[INFO] Using default encoding to copy filtered resources.
[INFO] [compiler:compile]
Compiling 14 source files to /home/maven/continuum-1.0.3/apps/continuum/working-directory/176/target/classes
[INFO] ----------------------------------------------------------------------------
[ERROR] BUILD FAILURE
[INFO] ----------------------------------------------------------------------------
[INFO] Compilation failure

/home/maven/continuum-1.0.3/apps/continuum/working-directory/176/src/main/java/org/apache/cocoon/classloader/WildcardMatcherHelper.java:[27,7]
duplicate class: org.apache.cocoon.util.WildcardMatcherHelper

/home/maven/continuum-1.0.3/apps/continuum/working-directory/176/src/main/java/org/apache/cocoon/classloader/DefaultClassLoader.java:[72,-1]
cannot access org.apache.cocoon.classloader.WildcardMatcherHelper
bad class file: /home/maven/continuum-1.0.3/apps/continuum/working-directory/176/src/main/java/org/apache/cocoon/classloader/WildcardMatcherHelper.java
file does not contain class org.apache.cocoon.classloader.WildcardMatcherHelper


[INFO] ----------------------------------------------------------------------------
[INFO] For more information, run Maven with the -e switch
[INFO] ----------------------------------------------------------------------------
[INFO] Total time: 4 seconds
[INFO] Finished at: Sat Jun 24 03:13:19 GMT+00:00 2006
[INFO] Final Memory: 4M/9M
[INFO] ----------------------------------------------------------------------------

****************************************************************************



Mime
View raw message