cocoon-dev mailing list archives

Site index · List index
Message view « Date » · « Thread »
Top « Date » · « Thread »
From "continuum@cocoon.zones.apache.org" <contin...@cocoon.zones.apache.org>
Subject [continuum] BUILD FAILURE: Forms Block Implementation
Date Fri, 26 May 2006 03:11:42 GMT
Online report : http://cocoon.zones.apache.org:12000/continuum/servlet/continuum/target/ProjectBuild.vm/view/ProjectBuild/id/46/buildId/1243
Build statistics:
  State: Failed
  Previous State: Ok
  Started at: Fri, 26 May 2006 03:11:01 +0000
  Finished at: Fri, 26 May 2006 03:11:42 +0000
  Total time: 41s
  Build Trigger: Schedule
  Exit code: 1
  Building machine hostname: cocoon.zones.apache.org
  Operating system : SunOS(unknown)
  Java version : 1.4.2_06(Sun Microsystems Inc.)

Changes
         simoneg          Calculated fields
             /cocoon/trunk/blocks/cocoon-forms/cocoon-forms-impl/src/main/java/org/apache/cocoon/forms/expression/DefaultExpressionManager.java
            /cocoon/trunk/blocks/cocoon-forms/cocoon-forms-impl/src/main/java/org/apache/cocoon/forms/expression/ExpressionManager.java
            /cocoon/trunk/blocks/cocoon-forms/cocoon-forms-impl/src/main/java/org/apache/cocoon/forms/expression/SumFunction.java
            /cocoon/trunk/blocks/cocoon-forms/cocoon-forms-impl/src/main/java/org/apache/cocoon/forms/formmodel/CalculatedField.java
            /cocoon/trunk/blocks/cocoon-forms/cocoon-forms-impl/src/main/java/org/apache/cocoon/forms/formmodel/CalculatedFieldAlgorithm.java
            /cocoon/trunk/blocks/cocoon-forms/cocoon-forms-impl/src/main/java/org/apache/cocoon/forms/formmodel/CalculatedFieldAlgorithmBuilder.java
            /cocoon/trunk/blocks/cocoon-forms/cocoon-forms-impl/src/main/java/org/apache/cocoon/forms/formmodel/CalculatedFieldDefinition.java
            /cocoon/trunk/blocks/cocoon-forms/cocoon-forms-impl/src/main/java/org/apache/cocoon/forms/formmodel/CalculatedFieldDefinitionBuilder.java
            /cocoon/trunk/blocks/cocoon-forms/cocoon-forms-impl/src/main/java/org/apache/cocoon/forms/formmodel/ExpressionContextImpl.java
            /cocoon/trunk/blocks/cocoon-forms/cocoon-forms-impl/src/main/java/org/apache/cocoon/forms/formmodel/algorithms
            /cocoon/trunk/blocks/cocoon-forms/cocoon-forms-impl/src/main/java/org/apache/cocoon/forms/formmodel/algorithms/AbstractBaseAlgorithm.java
            /cocoon/trunk/blocks/cocoon-forms/cocoon-forms-impl/src/main/java/org/apache/cocoon/forms/formmodel/algorithms/AbstractBaseAlgorithmBuilder.java
            /cocoon/trunk/blocks/cocoon-forms/cocoon-forms-impl/src/main/java/org/apache/cocoon/forms/formmodel/algorithms/JavaAlgorithmBuilder.java
            /cocoon/trunk/blocks/cocoon-forms/cocoon-forms-impl/src/main/java/org/apache/cocoon/forms/formmodel/algorithms/JavaScript.java
            /cocoon/trunk/blocks/cocoon-forms/cocoon-forms-impl/src/main/java/org/apache/cocoon/forms/formmodel/algorithms/JavaScriptBuilder.java
            /cocoon/trunk/blocks/cocoon-forms/cocoon-forms-impl/src/main/java/org/apache/cocoon/forms/formmodel/algorithms/RepeatedFormula.java
            /cocoon/trunk/blocks/cocoon-forms/cocoon-forms-impl/src/main/java/org/apache/cocoon/forms/formmodel/algorithms/RepeatedFormulaBuilder.java
            /cocoon/trunk/blocks/cocoon-forms/cocoon-forms-impl/src/main/java/org/apache/cocoon/forms/formmodel/algorithms/SimpleFormula.java
            /cocoon/trunk/blocks/cocoon-forms/cocoon-forms-impl/src/main/java/org/apache/cocoon/forms/formmodel/algorithms/SimpleFormulaBuilder.java
            /cocoon/trunk/blocks/cocoon-forms/cocoon-forms-impl/src/main/java/org/apache/cocoon/forms/util/WidgetFinder.java
        
****************************************************************************
Output:
****************************************************************************
[INFO] Scanning for projects...
[INFO] Searching repository for plugin with prefix: 'source'.
[INFO] ----------------------------------------------------------------------------
[INFO] Building Forms Block Implementation
[INFO]    task-segment: [clean, source:jar, deploy]
[INFO] ----------------------------------------------------------------------------
[INFO] [clean:clean]
[INFO] Deleting directory /home/maven/continuum-1.0.3/apps/continuum/working-directory/46/target
[INFO] [source:jar]
[INFO] Building jar: /home/maven/continuum-1.0.3/apps/continuum/working-directory/46/target/cocoon-forms-impl-1.0.0-SNAPSHOT-sources.jar
[INFO] [resources:resources]
[INFO] Using default encoding to copy filtered resources.
[INFO] snapshot org.apache.cocoon:cocoon-ajax-impl:1.0.0-SNAPSHOT: checking for updates from
central
[INFO] snapshot org.apache.cocoon:cocoon-ajax-impl:1.0.0-SNAPSHOT: checking for updates from
apache.snapshot
[INFO] snapshot org.apache.cocoon:cocoon-ajax-impl:1.0.0-SNAPSHOT: checking for updates from
apache-cvs
[INFO] snapshot org.apache.cocoon:cocoon-ajax-impl:1.0.0-SNAPSHOT: checking for updates from
apache.snapshots
[INFO] snapshot org.apache.cocoon:cocoon-ajax:1-SNAPSHOT: checking for updates from central
[INFO] snapshot org.apache.cocoon:cocoon-ajax:1-SNAPSHOT: checking for updates from apache.snapshot
[INFO] snapshot org.apache.cocoon:cocoon-ajax:1-SNAPSHOT: checking for updates from apache-cvs
[INFO] snapshot org.apache.cocoon:cocoon-ajax:1-SNAPSHOT: checking for updates from apache.snapshots
[INFO] snapshot org.apache.cocoon:cocoon-core:2.2.0-SNAPSHOT: checking for updates from central
[INFO] snapshot org.apache.cocoon:cocoon-core:2.2.0-SNAPSHOT: checking for updates from apache.snapshot
[INFO] snapshot org.apache.cocoon:cocoon-core:2.2.0-SNAPSHOT: checking for updates from apache-cvs
[INFO] snapshot org.apache.cocoon:cocoon-core:2.2.0-SNAPSHOT: checking for updates from apache.snapshots
[INFO] snapshot org.apache.cocoon:cocoon-core-modules:1-SNAPSHOT: checking for updates from
central
[INFO] snapshot org.apache.cocoon:cocoon-core-modules:1-SNAPSHOT: checking for updates from
apache.snapshot
[INFO] snapshot org.apache.cocoon:cocoon-core-modules:1-SNAPSHOT: checking for updates from
apache-cvs
[INFO] snapshot org.apache.cocoon:cocoon-core-modules:1-SNAPSHOT: checking for updates from
apache.snapshots
[INFO] snapshot org.apache.cocoon:cocoon-bootstrap:1.0.0-SNAPSHOT: checking for updates from
central
[INFO] snapshot org.apache.cocoon:cocoon-bootstrap:1.0.0-SNAPSHOT: checking for updates from
apache.snapshot
[INFO] snapshot org.apache.cocoon:cocoon-bootstrap:1.0.0-SNAPSHOT: checking for updates from
apache-cvs
[INFO] snapshot org.apache.cocoon:cocoon-bootstrap:1.0.0-SNAPSHOT: checking for updates from
apache.snapshots
[INFO] snapshot org.apache.cocoon:cocoon-licenses:1.0-SNAPSHOT: checking for updates from
central
[INFO] snapshot org.apache.cocoon:cocoon-licenses:1.0-SNAPSHOT: checking for updates from
apache.snapshot
[INFO] snapshot org.apache.cocoon:cocoon-licenses:1.0-SNAPSHOT: checking for updates from
apache-cvs
[INFO] snapshot org.apache.cocoon:cocoon-licenses:1.0-SNAPSHOT: checking for updates from
apache.snapshots
[INFO] [compiler:compile]
Compiling 377 source files to /home/maven/continuum-1.0.3/apps/continuum/working-directory/46/target/classes
[INFO] ----------------------------------------------------------------------------
[ERROR] BUILD FAILURE
[INFO] ----------------------------------------------------------------------------
[INFO] Compilation failure

/home/maven/continuum-1.0.3/apps/continuum/working-directory/46/src/main/java/org/apache/cocoon/forms/expression/DefaultExpressionManager.java:[65,14]
cannot resolve symbol
symbol  : method parse ()
location: class org.outerj.expression.FormulaParser

/home/maven/continuum-1.0.3/apps/continuum/working-directory/46/src/main/java/org/apache/cocoon/forms/expression/DefaultExpressionManager.java:[75,14]
cannot resolve symbol
symbol  : method parse ()
location: class org.outerj.expression.FormulaParser

/home/maven/continuum-1.0.3/apps/continuum/working-directory/46/src/main/java/org/apache/cocoon/forms/expression/DefaultExpressionManager.java:[76,21]
cannot resolve symbol
symbol  : method getVariables ()
location: class org.outerj.expression.FormulaParser

/home/maven/continuum-1.0.3/apps/continuum/working-directory/46/src/main/java/org/apache/cocoon/forms/formmodel/algorithms/SimpleFormulaBuilder.java:[65,31]
cannot resolve symbol
symbol  : method getVariableName ()
location: class org.outerj.expression.VariableFunction


[INFO] ----------------------------------------------------------------------------
[INFO] For more information, run Maven with the -e switch
[INFO] ----------------------------------------------------------------------------
[INFO] Total time: 39 seconds
[INFO] Finished at: Fri May 26 03:11:42 GMT+00:00 2006
[INFO] Final Memory: 5M/25M
[INFO] ----------------------------------------------------------------------------

****************************************************************************



Mime
View raw message