cocoon-dev mailing list archives

Site index · List index
Message view « Date » · « Thread »
Top « Date » · « Thread »
From Andrew Savory <and...@luminas.co.uk>
Subject Re: Cannot compile trunk
Date Fri, 05 May 2006 18:52:05 GMT
Hi,

Carsten Ziegeler wrote:

> What about others? Are Giacomo and I the only ones trying to build 2.2?

I tried this afternoon doing mvn clean install and got:

Compiling 346 source files to 
cocoon-trunk/blocks/cocoon-portal/cocoon-portal-impl/target/classes
[INFO] 
----------------------------------------------------------------------------
[ERROR] BUILD FAILURE
[INFO] 
----------------------------------------------------------------------------
[INFO] Compilation failure

Failure executing javac, but could not parse the error:


The system is out of resources.
Consult the following stack trace for details.
java.lang.OutOfMemoryError


and running with mvn -e I get:

[INFO] 
----------------------------------------------------------------------------
[ERROR] BUILD ERROR
[INFO] 
----------------------------------------------------------------------------
[INFO] There are test failures.
[INFO] 
----------------------------------------------------------------------------
[INFO] Trace
org.apache.maven.lifecycle.LifecycleExecutionException: There are test 
failures.
         at 
org.apache.maven.lifecycle.DefaultLifecycleExecutor.executeGoals(DefaultLifecycleExecutor.java:556)
         at 
org.apache.maven.lifecycle.DefaultLifecycleExecutor.executeGoalWithLifecycle(DefaultLifecycleExecutor.java:472)
         at 
org.apache.maven.lifecycle.DefaultLifecycleExecutor.executeGoal(DefaultLifecycleExecutor.java:451)
         at 
org.apache.maven.lifecycle.DefaultLifecycleExecutor.executeGoalAndHandleFailures(DefaultLifecycleExecutor.java:303)
         at 
org.apache.maven.lifecycle.DefaultLifecycleExecutor.executeTaskSegments(DefaultLifecycleExecutor.java:270)
         at 
org.apache.maven.lifecycle.DefaultLifecycleExecutor.execute(DefaultLifecycleExecutor.java:139)
         at org.apache.maven.DefaultMaven.doExecute(DefaultMaven.java:322)
         at org.apache.maven.DefaultMaven.execute(DefaultMaven.java:115)
         at org.apache.maven.cli.MavenCli.main(MavenCli.java:249)
         at sun.reflect.NativeMethodAccessorImpl.invoke0(Native Method)
         at 
sun.reflect.NativeMethodAccessorImpl.invoke(NativeMethodAccessorImpl.java:39)
         at 
sun.reflect.DelegatingMethodAccessorImpl.invoke(DelegatingMethodAccessorImpl.java:25)
         at java.lang.reflect.Method.invoke(Method.java:324)
         at 
org.codehaus.classworlds.Launcher.launchEnhanced(Launcher.java:315)
         at org.codehaus.classworlds.Launcher.launch(Launcher.java:255)
         at 
org.codehaus.classworlds.Launcher.mainWithExitCode(Launcher.java:430)
         at org.codehaus.classworlds.Launcher.main(Launcher.java:375)
Caused by: org.apache.maven.plugin.MojoExecutionException: There are 
test failures.
         at 
org.apache.maven.test.SurefirePlugin.execute(SurefirePlugin.java:389)
         at 
org.apache.maven.plugin.DefaultPluginManager.executeMojo(DefaultPluginManager.java:415)
         at 
org.apache.maven.lifecycle.DefaultLifecycleExecutor.executeGoals(DefaultLifecycleExecutor.java:531)
         ... 16 more
[INFO] 
----------------------------------------------------------------------------
[INFO] Total time: 59 seconds
[INFO] Finished at: Fri May 05 20:48:44 CEST 2006
[INFO] Final Memory: 41M/63M
[INFO] 
----------------------------------------------------------------------------


Not sure quite what's going on ... :-(

Thanks,

Andrew.
-- 
Andrew Savory, Managing Director, Luminas Limited
Tel: +44 (0)870 741 6658  Fax: +44 (0)700 598 1135
Web: http://www.luminas.co.uk/
Orixo alliance: http://www.orixo.com/

Mime
View raw message