cocoon-dev mailing list archives

Site index · List index
Message view « Date » · « Thread »
Top « Date » · « Thread »
From bugzi...@apache.org
Subject DO NOT REPLY [Bug 33394] New: - Does not compile under Java 1.5 - TransformerException if writing cocoon.roles
Date Thu, 03 Feb 2005 18:06:29 GMT
DO NOT REPLY TO THIS EMAIL, BUT PLEASE POST YOUR BUG·
RELATED COMMENTS THROUGH THE WEB INTERFACE AVAILABLE AT
<http://issues.apache.org/bugzilla/show_bug.cgi?id=33394>.
ANY REPLY MADE TO THIS MESSAGE WILL NOT BE COLLECTED AND·
INSERTED IN THE BUG DATABASE.

http://issues.apache.org/bugzilla/show_bug.cgi?id=33394

           Summary: Does not compile under Java 1.5 - TransformerException
                    if writing cocoon.roles
           Product: Cocoon 2
           Version: 2.1.6
          Platform: PC
        OS/Version: Windows XP
            Status: NEW
          Keywords: JDK1.5
          Severity: normal
          Priority: P2
         Component: general components
        AssignedTo: dev@cocoon.apache.org
        ReportedBy: jana.assmann@gmx.de


Before I tried to compile, i done this changes:
http://issues.apache.org/bugzilla/show_bug.cgi?id=33189
		--> enum is a keyword

build.bat
Buildfile: build.xml

----------------------------------------------------------------------
 Compiler options:
   - debug ......... [on]
   - optimize ...... [on]
   - deprecation ... [off]
======================================================================

compile-core:
Compiling 1 source file to D:\Downloads\Cocoon\cocoon-2.1.6\build\cocoon-2.1.6\c
lasses

compile-deprecated:
Created dir: D:\Downloads\Cocoon\cocoon-2.1.6\build\cocoon-2.1.6\deprecated
Processing: D:\Downloads\Cocoon\cocoon-2.1.6\src\deprecated\conf\deprecated.xrol
es
Writing: D:\Downloads\Cocoon\cocoon-2.1.6\build\cocoon-2.1.6\classes\org\apache\
cocoon\cocoon.roles

BUILD FAILED
D:\Downloads\Cocoon\cocoon-2.1.6\tools\targets\compile-build.xml:72: Transformer
Exception: javax.xml.transform.TransformerException: java.io.FileNotFoundExcepti
on: file:\D:\Downloads\Cocoon\cocoon-2.1.6\build\cocoon-2.1.6\classes\org\apache
\cocoon\cocoon.roles (Die Syntax f³r den Dateinamen, Verzeichnisnamen oder die D
atentrġgerbezeichnung ist falsch)

Total time: 4 seconds

-- 
Configure bugmail: http://issues.apache.org/bugzilla/userprefs.cgi?tab=email
------- You are receiving this mail because: -------
You are the assignee for the bug, or are watching the assignee.

Mime
View raw message