cocoon-dev mailing list archives

Site index · List index
Message view « Date » · « Thread »
Top « Date » · « Thread »
From bugzi...@apache.org
Subject DO NOT REPLY [Bug 26124] New: - Build failure of CVS snapshot -- cocoon-2.1_20040114111307.tar.gz
Date Wed, 14 Jan 2004 13:45:29 GMT
DO NOT REPLY TO THIS EMAIL, BUT PLEASE POST YOUR BUG 
RELATED COMMENTS THROUGH THE WEB INTERFACE AVAILABLE AT
<http://nagoya.apache.org/bugzilla/show_bug.cgi?id=26124>.
ANY REPLY MADE TO THIS MESSAGE WILL NOT BE COLLECTED AND 
INSERTED IN THE BUG DATABASE.

http://nagoya.apache.org/bugzilla/show_bug.cgi?id=26124

Build failure of CVS snapshot -- cocoon-2.1_20040114111307.tar.gz

           Summary: Build failure of CVS snapshot -- cocoon-
                    2.1_20040114111307.tar.gz
           Product: Cocoon 2
           Version: Current CVS 2.1
          Platform: PC
        OS/Version: Windows XP
            Status: NEW
          Severity: Blocker
          Priority: Other
         Component: core
        AssignedTo: dev@cocoon.apache.org
        ReportedBy: bart.remmerie@elia.be


Usually builds work fine, but today, ... it's just not working...

<output>
Writing: C:\cocoon-2.1\build\webapp\WEB-INF\logkit.xconf

BUILD FAILED
C:\cocoon-2.1\tools\targets\webapp-build.xml:75: Following error occured while 
executing this line
C:\cocoon-2.1\build\cocoon-2.1.4-dev\temp\blocks-build.xml:8535: IOException: 
java.net.ConnectException: Connection refused: connect

Total time: 6 minutes 59 seconds

</output>

The blocks-build.xml:8535 contains the following data:
<xpatch srcdir="${blocks}" file="${build.webapp}/WEB-INF/web.xml">

Mime
View raw message