cocoon-dev mailing list archives

Site index · List index
Message view « Date » · « Thread »
Top « Date » · « Thread »
From "Geoff Howard" <coc...@leverageweb.com>
Subject RE: build fails when not doing "build clean"
Date Thu, 05 Jun 2003 21:27:22 GMT
oops!  obviously I needed to test _twice_ before committing.  
should be fixed now.  I'm testing it but have to run out and 
the first build isn't finished.  

Geoff

> -----Original Message-----
> From: Joerg Heinicke [mailto:joerg.heinicke@gmx.de]
> Sent: Thursday, June 05, 2003 3:52 PM
> To: cocoon-dev@xml.apache.org
> Subject: build fails when not doing "build clean"
> 
> 
> Tried a "build webapp" (without clean). The build fails in target 
> "patch-conf":
> 
> ---------------------------
> 
> Processing: D:\cocoon-2.1\src\blocks\session-fw\conf\session.xconf
> Writing: D:\cocoon-2.1\build\webapp\WEB-INF\cocoon.xconf
> Processing: 
> D:\cocoon-2.1\src\blocks\authentication-fw\conf\authentication.xconf
> 
> Error in: D:\cocoon-2.1\src\blocks\authentication-fw\conf\provider.xconf
> 
> BUILD FAILED
> file:D:/cocoon-2.1/build/cocoon-2.1m3-dev/temp/blocks-build.xml:5588: 
> IOException: java.io.IOException: XPath 
> (/cocoon/session-context-providers) returned not one node, but 2 nodes
> 
> -----------------------
> 
> Exectuting "build webapp" once more and the count goes to 3 nodes 
> and so on.
> 
> Joerg
> 
> 
> 

Mime
View raw message