cocoon-dev mailing list archives

Site index · List index
Message view « Date » · « Thread »
Top « Date » · « Thread »
From Marcus Crafter <craft...@osa.de>
Subject Re: Compile problem (HEAD)
Date Wed, 04 Dec 2002 09:13:22 GMT
Hi Andrew,

I noticed that modules.xconf had an non-terminated file element in it, which 
was causing problems with the build. I've checked in a fix for the file, and 
the build seems to be working ok now. Can you confirm this for me ?

Thanks for reporting the error. :)

Cheers,

Marcus

> BUILD FAILED
> file:/home/andy/opensource/cocoon/xml-cocoon2/build.xml:1310: 
> IOException: java.io.IOException: XPath (/cocoon/input-modules) returned 
> not one node, but 0 nodes
> Total time: 1 minute 22 seconds
> [andy@localhost xml-cocoon2]$
> 
> So I checked out, and ran the build.sh clean compile installwar 'd
> 
> got that.
> 
> Tried copying the xml libs per the instructions...
> 
> same error.
> 
> Any ideas?

---------------------------------------------------------------------
To unsubscribe, e-mail: cocoon-dev-unsubscribe@xml.apache.org
For additional commands, email: cocoon-dev-help@xml.apache.org


Mime
View raw message