cocoon-dev mailing list archives

Site index · List index
Message view « Date » · « Thread »
Top « Date » · « Thread »
From "Andrew C. Oliver" <acoli...@apache.org>
Subject Compile problem (HEAD)
Date Wed, 04 Dec 2002 02:21:24 GMT

BUILD FAILED
file:/home/andy/opensource/cocoon/xml-cocoon2/build.xml:1310: 
IOException: java.io.IOException: XPath (/cocoon/input-modules) returned 
not one node, but 0 nodes
Total time: 1 minute 22 seconds
[andy@localhost xml-cocoon2]$

So I checked out, and ran the build.sh clean compile installwar 'd

got that.

Tried copying the xml libs per the instructions...

same error.

Any ideas?


---------------------------------------------------------------------
To unsubscribe, e-mail: cocoon-dev-unsubscribe@xml.apache.org
For additional commands, email: cocoon-dev-help@xml.apache.org


Mime
View raw message