cloudstack-users mailing list archives

Site index · List index
Message view « Date » · « Thread »
Top « Date » · « Thread »
From David Nalley <da...@gnsa.us>
Subject Re: Building RPMs
Date Sat, 18 May 2013 01:07:55 GMT
Why are you trying to build RPMs on Ubuntu?

Do you really need to build RPMs or can you just consume the prebuilt
RPMs from http://cloudstack.apt-get.eu/rhel/4.0/

--David

On Fri, May 17, 2013 at 1:18 PM, José Egas López
<joseegas@farmaenlace.com> wrote:
> Does anyone knows how to fix the error shown below?
> I'm working with CS 4.0.0 on UBU 12.04.1
>
>
> El 17/05/2013 9:23, David Nalley escribió:
>>
>> Which version?
>>
>>
>>
>> On Fri, May 17, 2013 at 10:22 AM,  <joseegas@farmaenlace.com> wrote:
>>>
>>> Hi,
>>>
>>> I have a trouble at building RPMs when running the command mvn -P deps,
>>> it
>>> returns the following:
>>>
>>> root@...:/var/www/cloudstack/repo/binary# mvn -P deps
>>> [INFO] Scanning for projects...
>>> [INFO]
>>> ------------------------------------------------------------------------
>>> [INFO] BUILD FAILURE
>>> [INFO]
>>> ------------------------------------------------------------------------
>>> [INFO] Total time: 0.255s
>>> [INFO] Finished at: Fri May 17 09:12:15 ECT 2013
>>> [INFO] Final Memory: 2M/59M
>>> [INFO]
>>> ------------------------------------------------------------------------
>>> [WARNING] The requested profile "deps" could not be activated because it
>>> does not exist.
>>> [ERROR] No goals have been specified for this build. You must specify a
>>> valid lifecycle phase or a goal in the format <plugin-prefix>:<goal>
or
>>> <plugin-group-id>:<plugin-artifact-id>[:<plugin-version>]:<goal>.
>>> Available lifecycle phases are: validate, initialize, generate-sources,
>>> process-sources, generate-resources, process-resources, compile,
>>> process-classes, generate-test-sources, process-test-sources,
>>> generate-test-resources, process-test-resources, test-compile,
>>> process-test-classes, test, prepare-package, package,
>>> pre-integration-test, integration-test, post-integration-test, verify,
>>> install, deploy, pre-clean, clean, post-clean, pre-site, site, post-site,
>>> site-deploy. -> [Help 1]
>>> [ERROR]
>>> [ERROR] To see the full stack trace of the errors, re-run Maven with the
>>> -e switch.
>>> [ERROR] Re-run Maven using the -X switch to enable full debug logging.
>>> [ERROR]
>>> [ERROR] For more information about the errors and possible solutions,
>>> please read the following articles:
>>> [ERROR] [Help 1]
>>> http://cwiki.apache.org/confluence/display/MAVEN/NoGoalSpecifiedException
>>>
>>> I need help please...
>>>
>>>
>>> ####################################################
>>> FARMAENLACE ha procesado su mensaje y esta limpio
>>> No imprima este mail a menos que sea necesario
>>>
>> ####################################################
>> FARMAENLACE ha procesado su mensaje y esta limpio
>> No imprima este mail a menos que sea necesario
>>
>
>
> ####################################################
> FARMAENLACE ha procesado su mensaje y esta limpio
> No imprima este mail a menos que sea necesario
>

Mime
View raw message