cloudstack-users mailing list archives

Site index · List index
Message view « Date » · « Thread »
Top « Date » · « Thread »
From Nitin Mehta <Nitin.Me...@citrix.com>
Subject Re: System VM's won't boot on CS4 XenServer 6.0.2
Date Wed, 17 Apr 2013 06:35:59 GMT
Can you also please check the logs on Xenserver especially the SMlog -
that might give more clue

On 17/04/13 9:20 AM, "Ahmad Emneina" <aemneina@gmail.com> wrote:

>my guess is that CloudStack cant copy the template from secondary to
>primary storage. Can you check the write permissions on your primary
>storage?
>
>
>On Tue, Apr 16, 2013 at 11:15 AM, Joe Schoonbeck <joe@jx9.net> wrote:
>
>> Getting the below error, system VM's won't provision. Verified
>>networking
>> and vhd-util works on both the xenserver and master. I'm able to access
>> the NFS on the master from the xenserver, so no problems there either.
>>Any
>> ideas?
>>
>>
>> 2013-04-16 14:09:56,868 WARN  [xen.resource.CitrixResourceBase]
>> (DirectAgent-26:null) can not create vdi in sr
>> 67bb7c6b-784a-9ed4-b370-abd0b950b908
>> 2013-04-16 14:09:56,869 WARN  [xen.resource.CitrixResourceBase]
>> (DirectAgent-26:null) Catch Exception
>> com.cloud.utils.exception.CloudRuntimeException on
>> host:3d714397-cd1f-4b11-aa8a-c3e4196093e3 for template:
>> nfs://208.85.1.110/export/secondary/template/tmpl/1/1/ due to
>> com.cloud.utils.exception.CloudRuntimeException: can not create vdi in
>>sr
>> 67bb7c6b-784a-9ed4-b370-abd0b950b908
>> com.cloud.utils.exception.CloudRuntimeException: can not create vdi in
>>sr
>> 67bb7c6b-784a-9ed4-b370-abd0b950b908
>>
>>
>> 2013-04-16 14:09:56,870 DEBUG [agent.manager.AgentManagerImpl]
>> (secstorage-1:null) Details from executing class
>> com.cloud.agent.api.storage.PrimaryStorageDownloadCommand: Catch
>>Exception
>> com.cloud.utils.exception.CloudRuntimeException on
>> host:3d714397-cd1f-4b11-aa8a-c3e4196093e3 for template:
>> nfs://208.85.1.110/export/secondary/template/tmpl/1/1/ due to
>> com.cloud.utils.exception.CloudRuntimeException: can not create vdi in
>>sr
>> 67bb7c6b-784a-9ed4-b370-abd0b950b908
>>
>> 2013-04-16 14:09:56,870 DEBUG [cloud.template.TemplateManagerImpl]
>> (secstorage-1:null) Template 1 download to pool 200 failed due to Catch
>> Exception com.cloud.utils.exception.CloudRuntimeException on
>> host:3d714397-cd1f-4b11-aa8a-c3e4196093e3 for template:
>> nfs://208.85.1.110/export/secondary/template/tmpl/1/1/ due to
>> com.cloud.utils.exception.CloudRuntimeException: can not create vdi in
>>sr
>> 67bb7c6b-784a-9ed4-b370-abd0b950b908
>>
>>


Mime
View raw message