cloudstack-users-cn mailing list archives

Site index · List index
Message view « Date » · « Thread »
Top « Date » · « Thread »
From "赵涛" <zhaotao...@qq.com>
Subject 回复: 编译cloudstack4.4.1 nonoss出错
Date Fri, 31 Oct 2014 02:43:35 GMT
谢谢,我先试试看




------------------ 原始邮件 ------------------
发件人: "linuxbqj@gmail.com";<linuxbqj@gmail.com>;
发送时间: 2014年10月31日(星期五) 上午10:40
收件人: "users-cn"<users-cn@cloudstack.apache.org>; 

主题: Re: 编译cloudstack4.4.1 nonoss出错



The certificate used in the unit test has expired. As Frank mentioned
in the other thread, simply remove the
CertServiceTest.java file from the source and rebuild.

2014-10-28 13:24 GMT+08:00 zt <zhaotao_cn@qq.com>:
> 编译cloudstack4.4.1 nonoss出错:使用命令# mvn install -Dnoredist
> 请教各位大神们,多谢!
> log如下:
> -------------------------------------------------------------------------------
> Test set: org.apache.cloudstack.network.lb.CertServiceTest
> -------------------------------------------------------------------------------
> Tests run: 15, Failures: 5, Errors: 3, Skipped: 0, Time elapsed: 0.516 sec <<<
FAILURE!
> runUploadSslCertBadkeyAlgo(org.apache.cloudstack.network.lb.CertServiceTest) Time elapsed:
0.119 sec <<< FAILURE!
> java.lang.AssertionError
> at org.junit.Assert.fail(Assert.java:86)
> at org.junit.Assert.assertTrue(Assert.java:41)
> at org.junit.Assert.assertTrue(Assert.java:52)
> at org.apache.cloudstack.network.lb.CertServiceTest.runUploadSslCertBadkeyAlgo(CertServiceTest.java:539)
> at sun.reflect.NativeMethodAccessorImpl.invoke0(Native Method)
> at sun.reflect.NativeMethodAccessorImpl.invoke(NativeMethodAccessorImpl.java:57)
> at sun.reflect.DelegatingMethodAccessorImpl.invoke(DelegatingMethodAccessorImpl.java:43)
> at java.lang.reflect.Method.invoke(Method.java:606)
> at org.junit.runners.model.FrameworkMethod$1.runReflectiveCall(FrameworkMethod.java:47)
> at org.junit.internal.runners.model.ReflectiveCallable.run(ReflectiveCallable.java:12)
> at org.junit.runners.model.FrameworkMethod.invokeExplosively(FrameworkMethod.java:44)
> at org.junit.internal.runners.statements.InvokeMethod.evaluate(InvokeMethod.java:17)
> at org.junit.internal.runners.statements.RunBefores.evaluate(RunBefores.java:26)
> at org.junit.internal.runners.statements.RunAfters.evaluate(RunAfters.java:27)
> at org.junit.runners.ParentRunner.runLeaf(ParentRunner.java:271)
> at org.junit.runners.BlockJUnit4ClassRunner.runChild(BlockJUnit4ClassRunner.java:70)
> at org.junit.runners.BlockJUnit4ClassRunner.runChild(BlockJUnit4ClassRunner.java:50)
> at org.junit.runners.ParentRunner$3.run(ParentRunner.java:238)
> at org.junit.runners.ParentRunner$1.schedule(ParentRunner.java:63)
> at org.junit.runners.ParentRunner.runChildren(ParentRunner.java:236)
> at org.junit.runners.ParentRunner.access$000(ParentRunner.java:53)
> at org.junit.runners.ParentRunner$2.evaluate(ParentRunner.java:229)
> at org.junit.runners.ParentRunner.run(ParentRunner.java:309)
> at org.apache.maven.surefire.junit4.JUnit4Provider.execute(JUnit4Provider.java:236)
> at org.apache.maven.surefire.junit4.JUnit4Provider.executeTestSet(JUnit4Provider.java:134)
> at org.apache.maven.surefire.junit4.JUnit4Provider.invoke(JUnit4Provider.java:113)
> at sun.reflect.NativeMethodAccessorImpl.invoke0(Native Method)
> at sun.reflect.NativeMethodAccessorImpl.invoke(NativeMethodAccessorImpl.java:57)
> at sun.reflect.DelegatingMethodAccessorImpl.invoke(DelegatingMethodAccessorImpl.java:43)
> at java.lang.reflect.Method.invoke(Method.java:606)
> at org.apache.maven.surefire.util.ReflectionUtils.invokeMethodWithArray(ReflectionUtils.java:189)
> at org.apache.maven.surefire.booter.ProviderFactory$ProviderProxy.invoke(ProviderFactory.java:165)
> at org.apache.maven.surefire.booter.ProviderFactory.invokeProvider(ProviderFactory.java:85)
> at org.apache.maven.surefire.booter.ForkedBooter.runSuitesInProcess(ForkedBooter.java:103)
> at org.apache.maven.surefire.booter.ForkedBooter.main(ForkedBooter.java:74)
> runUploadSslCertBadkeyPair(org.apache.cloudstack.network.lb.CertServiceTest) Time elapsed:
0.01 sec <<< FAILURE!
> java.lang.AssertionError
> at org.junit.Assert.fail(Assert.java:86)
> at org.junit.Assert.assertTrue(Assert.java:41)
> at org.junit.Assert.assertTrue(Assert.java:52)
> at org.apache.cloudstack.network.lb.CertServiceTest.runUploadSslCertBadkeyPair(CertServiceTest.java:495)
> at sun.reflect.NativeMethodAccessorImpl.invoke0(Native Method)
> at sun.reflect.NativeMethodAccessorImpl.invoke(NativeMethodAccessorImpl.java:57)
> at sun.reflect.DelegatingMethodAccessorImpl.invoke(DelegatingMethodAccessorImpl.java:43)
> at java.lang.reflect.Method.invoke(Method.java:606)
> at org.junit.runners.model.FrameworkMethod$1.runReflectiveCall(FrameworkMethod.java:47)
> at org.junit.internal.runners.model.ReflectiveCallable.run(ReflectiveCallable.java:12)
> at org.junit.runners.model.FrameworkMethod.invokeExplosively(FrameworkMethod.java:44)
> at org.junit.internal.runners.statements.InvokeMethod.evaluate(InvokeMethod.java:17)
> at org.junit.internal.runners.statements.RunBefores.evaluate(RunBefores.java:26)
> at org.junit.internal.runners.statements.RunAfters.evaluate(RunAfters.java:27)
> at org.junit.runners.ParentRunner.runLeaf(ParentRunner.java:271)
> at org.junit.runners.BlockJUnit4ClassRunner.runChild(BlockJUnit4ClassRunner.java:70)
> at org.junit.runners.BlockJUnit4ClassRunner.runChild(BlockJUnit4ClassRunner.java:50)
> at org.junit.runners.ParentRunner$3.run(ParentRunner.java:238)
> at org.junit.runners.ParentRunner$1.schedule(ParentRunner.java:63)
> at org.junit.runners.ParentRunner.runChildren(ParentRunner.java:236)
> at org.junit.runners.ParentRunner.access$000(ParentRunner.java:53)
> at org.junit.runners.ParentRunner$2.evaluate(ParentRunner.java:229)
> at org.junit.runners.ParentRunner.run(ParentRunner.java:309)
> at org.apache.maven.surefire.junit4.JUnit4Provider.execute(JUnit4Provider.java:236)
> at org.apache.maven.surefire.junit4.JUnit4Provider.executeTestSet(JUnit4Provider.java:134)
> at org.apache.maven.surefire.junit4.JUnit4Provider.invoke(JUnit4Provider.java:113)
> at sun.reflect.NativeMethodAccessorImpl.invoke0(Native Method)
> at sun.reflect.NativeMethodAccessorImpl.invoke(NativeMethodAccessorImpl.java:57)
> at sun.reflect.DelegatingMethodAccessorImpl.invoke(DelegatingMethodAccessorImpl.java:43)
> at java.lang.reflect.Method.invoke(Method.java:606)
> at org.apache.maven.surefire.util.ReflectionUtils.invokeMethodWithArray(ReflectionUtils.java:189)
> at org.apache.maven.surefire.booter.ProviderFactory$ProviderProxy.invoke(ProviderFactory.java:165)
> at org.apache.maven.surefire.booter.ProviderFactory.invokeProvider(ProviderFactory.java:85)
> at org.apache.maven.surefire.booter.ForkedBooter.runSuitesInProcess(ForkedBooter.java:103)
> at org.apache.maven.surefire.booter.ForkedBooter.main(ForkedBooter.java:74)
> runUploadSslCertWithCAChain(org.apache.cloudstack.network.lb.CertServiceTest) Time elapsed:
0.18 sec <<< ERROR!
> com.cloud.utils.exception.CloudRuntimeException: Error parsing certificate data Certificate
expired or not valid
> at org.apache.cloudstack.network.lb.CertServiceImpl.uploadSslCert(CertServiceImpl.java:145)
> at org.apache.cloudstack.network.lb.CertServiceTest.runUploadSslCertWithCAChain(CertServiceTest.java:145)
> at sun.reflect.NativeMethodAccessorImpl.invoke0(Native Method)
> at sun.reflect.NativeMethodAccessorImpl.invoke(NativeMethodAccessorImpl.java:57)
> at sun.reflect.DelegatingMethodAccessorImpl.invoke(DelegatingMethodAccessorImpl.java:43)
> at java.lang.reflect.Method.invoke(Method.java:606)
> at org.junit.runners.model.FrameworkMethod$1.runReflectiveCall(FrameworkMethod.java:47)
> at org.junit.internal.runners.model.ReflectiveCallable.run(ReflectiveCallable.java:12)
> at org.junit.runners.model.FrameworkMethod.invokeExplosively(FrameworkMethod.java:44)
> at org.junit.internal.runners.statements.InvokeMethod.evaluate(InvokeMethod.java:17)
> at org.junit.internal.runners.statements.RunBefores.evaluate(RunBefores.java:26)
> at org.junit.internal.runners.statements.RunAfters.evaluate(RunAfters.java:27)
> at org.junit.runners.ParentRunner.runLeaf(ParentRunner.java:271)
> at org.junit.runners.BlockJUnit4ClassRunner.runChild(BlockJUnit4ClassRunner.java:70)
> at org.junit.runners.BlockJUnit4ClassRunner.runChild(BlockJUnit4ClassRunner.java:50)
> at org.junit.runners.ParentRunner$3.run(ParentRunner.java:238)
> at org.junit.runners.ParentRunner$1.schedule(ParentRunner.java:63)
> at org.junit.runners.ParentRunner.runChildren(ParentRunner.java:236)
> at org.junit.runners.ParentRunner.access$000(ParentRunner.java:53)
> at org.junit.runners.ParentRunner$2.evaluate(ParentRunner.java:229)
> at org.junit.runners.ParentRunner.run(ParentRunner.java:309)
> at org.apache.maven.surefire.junit4.JUnit4Provider.execute(JUnit4Provider.java:236)
> at org.apache.maven.surefire.junit4.JUnit4Provider.executeTestSet(JUnit4Provider.java:134)
> at org.apache.maven.surefire.junit4.JUnit4Provider.invoke(JUnit4Provider.java:113)
> at sun.reflect.NativeMethodAccessorImpl.invoke0(Native Method)
> at sun.reflect.NativeMethodAccessorImpl.invoke(NativeMethodAccessorImpl.java:57)
> at sun.reflect.DelegatingMethodAccessorImpl.invoke(DelegatingMethodAccessorImpl.java:43)
> at java.lang.reflect.Method.invoke(Method.java:606)
> at org.apache.maven.surefire.util.ReflectionUtils.invokeMethodWithArray(ReflectionUtils.java:189)
> at org.apache.maven.surefire.booter.ProviderFactory$ProviderProxy.invoke(ProviderFactory.java:165)
> at org.apache.maven.surefire.booter.ProviderFactory.invokeProvider(ProviderFactory.java:85)
> at org.apache.maven.surefire.booter.ForkedBooter.runSuitesInProcess(ForkedBooter.java:103)
> at org.apache.maven.surefire.booter.ForkedBooter.main(ForkedBooter.java:74)
> runUploadSslCertBadChain(org.apache.cloudstack.network.lb.CertServiceTest) Time elapsed:
0.043 sec <<< FAILURE!
> java.lang.AssertionError
> at org.junit.Assert.fail(Assert.java:86)
> at org.junit.Assert.assertTrue(Assert.java:41)
> at org.junit.Assert.assertTrue(Assert.java:52)
> at org.apache.cloudstack.network.lb.CertServiceTest.runUploadSslCertBadChain(CertServiceTest.java:296)
> at sun.reflect.NativeMethodAccessorImpl.invoke0(Native Method)
> at sun.reflect.NativeMethodAccessorImpl.invoke(NativeMethodAccessorImpl.java:57)
> at sun.reflect.DelegatingMethodAccessorImpl.invoke(DelegatingMethodAccessorImpl.java:43)
> at java.lang.reflect.Method.invoke(Method.java:606)
> at org.junit.runners.model.FrameworkMethod$1.runReflectiveCall(FrameworkMethod.java:47)
> at org.junit.internal.runners.model.ReflectiveCallable.run(ReflectiveCallable.java:12)
> at org.junit.runners.model.FrameworkMethod.invokeExplosively(FrameworkMethod.java:44)
> at org.junit.internal.runners.statements.InvokeMethod.evaluate(InvokeMethod.java:17)
> at org.junit.internal.runners.statements.RunBefores.evaluate(RunBefores.java:26)
> at org.junit.internal.runners.statements.RunAfters.evaluate(RunAfters.java:27)
> at org.junit.runners.ParentRunner.runLeaf(ParentRunner.java:271)
> at org.junit.runners.BlockJUnit4ClassRunner.runChild(BlockJUnit4ClassRunner.java:70)
> at org.junit.runners.BlockJUnit4ClassRunner.runChild(BlockJUnit4ClassRunner.java:50)
> at org.junit.runners.ParentRunner$3.run(ParentRunner.java:238)
> at org.junit.runners.ParentRunner$1.schedule(ParentRunner.java:63)
> at org.junit.runners.ParentRunner.runChildren(ParentRunner.java:236)
> at org.junit.runners.ParentRunner.access$000(ParentRunner.java:53)
> at org.junit.runners.ParentRunner$2.evaluate(ParentRunner.java:229)
> at org.junit.runners.ParentRunner.run(ParentRunner.java:309)
> at org.apache.maven.surefire.junit4.JUnit4Provider.execute(JUnit4Provider.java:236)
> at org.apache.maven.surefire.junit4.JUnit4Provider.executeTestSet(JUnit4Provider.java:134)
> at org.apache.maven.surefire.junit4.JUnit4Provider.invoke(JUnit4Provider.java:113)
> at sun.reflect.NativeMethodAccessorImpl.invoke0(Native Method)
> at sun.reflect.NativeMethodAccessorImpl.invoke(NativeMethodAccessorImpl.java:57)
> at sun.reflect.DelegatingMethodAccessorImpl.invoke(DelegatingMethodAccessorImpl.java:43)
> at java.lang.reflect.Method.invoke(Method.java:606)
> at org.apache.maven.surefire.util.ReflectionUtils.invokeMethodWithArray(ReflectionUtils.java:189)
> at org.apache.maven.surefire.booter.ProviderFactory$ProviderProxy.invoke(ProviderFactory.java:165)
> at org.apache.maven.surefire.booter.ProviderFactory.invokeProvider(ProviderFactory.java:85)
> at org.apache.maven.surefire.booter.ForkedBooter.runSuitesInProcess(ForkedBooter.java:103)
> at org.apache.maven.surefire.booter.ForkedBooter.main(ForkedBooter.java:74)
> runUploadSslCertNoRootCert(org.apache.cloudstack.network.lb.CertServiceTest) Time elapsed:
0.031 sec <<< FAILURE!
> java.lang.AssertionError
> at org.junit.Assert.fail(Assert.java:86)
> at org.junit.Assert.assertTrue(Assert.java:41)
> at org.junit.Assert.assertTrue(Assert.java:52)
> at org.apache.cloudstack.network.lb.CertServiceTest.runUploadSslCertNoRootCert(CertServiceTest.java:352)
> at sun.reflect.NativeMethodAccessorImpl.invoke0(Native Method)
> at sun.reflect.NativeMethodAccessorImpl.invoke(NativeMethodAccessorImpl.java:57)
> at sun.reflect.DelegatingMethodAccessorImpl.invoke(DelegatingMethodAccessorImpl.java:43)
> at java.lang.reflect.Method.invoke(Method.java:606)
> at org.junit.runners.model.FrameworkMethod$1.runReflectiveCall(FrameworkMethod.java:47)
> at org.junit.internal.runners.model.ReflectiveCallable.run(ReflectiveCallable.java:12)
> at org.junit.runners.model.FrameworkMethod.invokeExplosively(FrameworkMethod.java:44)
> at org.junit.internal.runners.statements.InvokeMethod.evaluate(InvokeMethod.java:17)
> at org.junit.internal.runners.statements.RunBefores.evaluate(RunBefores.java:26)
> at org.junit.internal.runners.statements.RunAfters.evaluate(RunAfters.java:27)
> at org.junit.runners.ParentRunner.runLeaf(ParentRunner.java:271)
> at org.junit.runners.BlockJUnit4ClassRunner.runChild(BlockJUnit4ClassRunner.java:70)
> at org.junit.runners.BlockJUnit4ClassRunner.runChild(BlockJUnit4ClassRunner.java:50)
> at org.junit.runners.ParentRunner$3.run(ParentRunner.java:238)
> at org.junit.runners.ParentRunner$1.schedule(ParentRunner.java:63)
> at org.junit.runners.ParentRunner.runChildren(ParentRunner.java:236)
> at org.junit.runners.ParentRunner.access$000(ParentRunner.java:53)
> at org.junit.runners.ParentRunner$2.evaluate(ParentRunner.java:229)
> at org.junit.runners.ParentRunner.run(ParentRunner.java:309)
> at org.apache.maven.surefire.junit4.JUnit4Provider.execute(JUnit4Provider.java:236)
> at org.apache.maven.surefire.junit4.JUnit4Provider.executeTestSet(JUnit4Provider.java:134)
> at org.apache.maven.surefire.junit4.JUnit4Provider.invoke(JUnit4Provider.java:113)
> at sun.reflect.NativeMethodAccessorImpl.invoke0(Native Method)
> at sun.reflect.NativeMethodAccessorImpl.invoke(NativeMethodAccessorImpl.java:57)
> at sun.reflect.DelegatingMethodAccessorImpl.invoke(DelegatingMethodAccessorImpl.java:43)
> at java.lang.reflect.Method.invoke(Method.java:606)
> at org.apache.maven.surefire.util.ReflectionUtils.invokeMethodWithArray(ReflectionUtils.java:189)
> at org.apache.maven.surefire.booter.ProviderFactory$ProviderProxy.invoke(ProviderFactory.java:165)
> at org.apache.maven.surefire.booter.ProviderFactory.invokeProvider(ProviderFactory.java:85)
> at org.apache.maven.surefire.booter.ForkedBooter.runSuitesInProcess(ForkedBooter.java:103)
> at org.apache.maven.surefire.booter.ForkedBooter.main(ForkedBooter.java:74)
> runUploadSslCertSelfSignedNoPassword(org.apache.cloudstack.network.lb.CertServiceTest)
Time elapsed: 0.005 sec <<< ERROR!
> com.cloud.utils.exception.CloudRuntimeException: Error parsing certificate data Certificate
expired or not valid
> at org.apache.cloudstack.network.lb.CertServiceImpl.uploadSslCert(CertServiceImpl.java:145)
> at org.apache.cloudstack.network.lb.CertServiceTest.runUploadSslCertSelfSignedNoPassword(CertServiceTest.java:242)
> at sun.reflect.NativeMethodAccessorImpl.invoke0(Native Method)
> at sun.reflect.NativeMethodAccessorImpl.invoke(NativeMethodAccessorImpl.java:57)
> at sun.reflect.DelegatingMethodAccessorImpl.invoke(DelegatingMethodAccessorImpl.java:43)
> at java.lang.reflect.Method.invoke(Method.java:606)
> at org.junit.runners.model.FrameworkMethod$1.runReflectiveCall(FrameworkMethod.java:47)
> at org.junit.internal.runners.model.ReflectiveCallable.run(ReflectiveCallable.java:12)
> at org.junit.runners.model.FrameworkMethod.invokeExplosively(FrameworkMethod.java:44)
> at org.junit.internal.runners.statements.InvokeMethod.evaluate(InvokeMethod.java:17)
> at org.junit.internal.runners.statements.RunBefores.evaluate(RunBefores.java:26)
> at org.junit.internal.runners.statements.RunAfters.evaluate(RunAfters.java:27)
> at org.junit.runners.ParentRunner.runLeaf(ParentRunner.java:271)
> at org.junit.runners.BlockJUnit4ClassRunner.runChild(BlockJUnit4ClassRunner.java:70)
> at org.junit.runners.BlockJUnit4ClassRunner.runChild(BlockJUnit4ClassRunner.java:50)
> at org.junit.runners.ParentRunner$3.run(ParentRunner.java:238)
> at org.junit.runners.ParentRunner$1.schedule(ParentRunner.java:63)
> at org.junit.runners.ParentRunner.runChildren(ParentRunner.java:236)
> at org.junit.runners.ParentRunner.access$000(ParentRunner.java:53)
> at org.junit.runners.ParentRunner$2.evaluate(ParentRunner.java:229)
> at org.junit.runners.ParentRunner.run(ParentRunner.java:309)
> at org.apache.maven.surefire.junit4.JUnit4Provider.execute(JUnit4Provider.java:236)
> at org.apache.maven.surefire.junit4.JUnit4Provider.executeTestSet(JUnit4Provider.java:134)
> at org.apache.maven.surefire.junit4.JUnit4Provider.invoke(JUnit4Provider.java:113)
> at sun.reflect.NativeMethodAccessorImpl.invoke0(Native Method)
> at sun.reflect.NativeMethodAccessorImpl.invoke(NativeMethodAccessorImpl.java:57)
> at sun.reflect.DelegatingMethodAccessorImpl.invoke(DelegatingMethodAccessorImpl.java:43)
> at java.lang.reflect.Method.invoke(Method.java:606)
> at org.apache.maven.surefire.util.ReflectionUtils.invokeMethodWithArray(ReflectionUtils.java:189)
> at org.apache.maven.surefire.booter.ProviderFactory$ProviderProxy.invoke(ProviderFactory.java:165)
> at org.apache.maven.surefire.booter.ProviderFactory.invokeProvider(ProviderFactory.java:85)
> at org.apache.maven.surefire.booter.ForkedBooter.runSuitesInProcess(ForkedBooter.java:103)
> at org.apache.maven.surefire.booter.ForkedBooter.main(ForkedBooter.java:74)
> runUploadSslCertNoChain(org.apache.cloudstack.network.lb.CertServiceTest) Time elapsed:
0.034 sec <<< FAILURE!
> java.lang.AssertionError
> at org.junit.Assert.fail(Assert.java:86)
> at org.junit.Assert.assertTrue(Assert.java:41)
> at org.junit.Assert.assertTrue(Assert.java:52)
> at org.apache.cloudstack.network.lb.CertServiceTest.runUploadSslCertNoChain(CertServiceTest.java:403)
> at sun.reflect.NativeMethodAccessorImpl.invoke0(Native Method)
> at sun.reflect.NativeMethodAccessorImpl.invoke(NativeMethodAccessorImpl.java:57)
> at sun.reflect.DelegatingMethodAccessorImpl.invoke(DelegatingMethodAccessorImpl.java:43)
> at java.lang.reflect.Method.invoke(Method.java:606)
> at org.junit.runners.model.FrameworkMethod$1.runReflectiveCall(FrameworkMethod.java:47)
> at org.junit.internal.runners.model.ReflectiveCallable.run(ReflectiveCallable.java:12)
> at org.junit.runners.model.FrameworkMethod.invokeExplosively(FrameworkMethod.java:44)
> at org.junit.internal.runners.statements.InvokeMethod.evaluate(InvokeMethod.java:17)
> at org.junit.internal.runners.statements.RunBefores.evaluate(RunBefores.java:26)
> at org.junit.internal.runners.statements.RunAfters.evaluate(RunAfters.java:27)
> at org.junit.runners.ParentRunner.runLeaf(ParentRunner.java:271)
> at org.junit.runners.BlockJUnit4ClassRunner.runChild(BlockJUnit4ClassRunner.java:70)
> at org.junit.runners.BlockJUnit4ClassRunner.runChild(BlockJUnit4ClassRunner.java:50)
> at org.junit.runners.ParentRunner$3.run(ParentRunner.java:238)
> at org.junit.runners.ParentRunner$1.schedule(ParentRunner.java:63)
> at org.junit.runners.ParentRunner.runChildren(ParentRunner.java:236)
> at org.junit.runners.ParentRunner.access$000(ParentRunner.java:53)
> at org.junit.runners.ParentRunner$2.evaluate(ParentRunner.java:229)
> at org.junit.runners.ParentRunner.run(ParentRunner.java:309)
> at org.apache.maven.surefire.junit4.JUnit4Provider.execute(JUnit4Provider.java:236)
> at org.apache.maven.surefire.junit4.JUnit4Provider.executeTestSet(JUnit4Provider.java:134)
> at org.apache.maven.surefire.junit4.JUnit4Provider.invoke(JUnit4Provider.java:113)
> at sun.reflect.NativeMethodAccessorImpl.invoke0(Native Method)
> at sun.reflect.NativeMethodAccessorImpl.invoke(NativeMethodAccessorImpl.java:57)
> at sun.reflect.DelegatingMethodAccessorImpl.invoke(DelegatingMethodAccessorImpl.java:43)
> at java.lang.reflect.Method.invoke(Method.java:606)
> at org.apache.maven.surefire.util.ReflectionUtils.invokeMethodWithArray(ReflectionUtils.java:189)
> at org.apache.maven.surefire.booter.ProviderFactory$ProviderProxy.invoke(ProviderFactory.java:165)
> at org.apache.maven.surefire.booter.ProviderFactory.invokeProvider(ProviderFactory.java:85)
> at org.apache.maven.surefire.booter.ForkedBooter.runSuitesInProcess(ForkedBooter.java:103)
> at org.apache.maven.surefire.booter.ForkedBooter.main(ForkedBooter.java:74)
> runUploadSslCertSelfSignedWithPassword(org.apache.cloudstack.network.lb.CertServiceTest)
Time elapsed: 0.005 sec <<< ERROR!
> com.cloud.utils.exception.CloudRuntimeException: Error parsing certificate data Certificate
expired or not valid
> at org.apache.cloudstack.network.lb.CertServiceImpl.uploadSslCert(CertServiceImpl.java:145)
> at org.apache.cloudstack.network.lb.CertServiceTest.runUploadSslCertSelfSignedWithPassword(CertServiceTest.java:196)
> at sun.reflect.NativeMethodAccessorImpl.invoke0(Native Method)
> at sun.reflect.NativeMethodAccessorImpl.invoke(NativeMethodAccessorImpl.java:57)
> at sun.reflect.DelegatingMethodAccessorImpl.invoke(DelegatingMethodAccessorImpl.java:43)
> at java.lang.reflect.Method.invoke(Method.java:606)
> at org.junit.runners.model.FrameworkMethod$1.runReflectiveCall(FrameworkMethod.java:47)
> at org.junit.internal.runners.model.ReflectiveCallable.run(ReflectiveCallable.java:12)
> at org.junit.runners.model.FrameworkMethod.invokeExplosively(FrameworkMethod.java:44)
> at org.junit.internal.runners.statements.InvokeMethod.evaluate(InvokeMethod.java:17)
> at org.junit.internal.runners.statements.RunBefores.evaluate(RunBefores.java:26)
> at org.junit.internal.runners.statements.RunAfters.evaluate(RunAfters.java:27)
> at org.junit.runners.ParentRunner.runLeaf(ParentRunner.java:271)
> at org.junit.runners.BlockJUnit4ClassRunner.runChild(BlockJUnit4ClassRunner.java:70)
> at org.junit.runners.BlockJUnit4ClassRunner.runChild(BlockJUnit4ClassRunner.java:50)
> at org.junit.runners.ParentRunner$3.run(ParentRunner.java:238)
> at org.junit.runners.ParentRunner$1.schedule(ParentRunner.java:63)
> at org.junit.runners.ParentRunner.runChildren(ParentRunner.java:236)
> at org.junit.runners.ParentRunner.access$000(ParentRunner.java:53)
> at org.junit.runners.ParentRunner$2.evaluate(ParentRunner.java:229)
> at org.junit.runners.ParentRunner.run(ParentRunner.java:309)
> at org.apache.maven.surefire.junit4.JUnit4Provider.execute(JUnit4Provider.java:236)
> at org.apache.maven.surefire.junit4.JUnit4Provider.executeTestSet(JUnit4Provider.java:134)
> at org.apache.maven.surefire.junit4.JUnit4Provider.invoke(JUnit4Provider.java:113)
> at sun.reflect.NativeMethodAccessorImpl.invoke0(Native Method)
> at sun.reflect.NativeMethodAccessorImpl.invoke(NativeMethodAccessorImpl.java:57)
> at sun.reflect.DelegatingMethodAccessorImpl.invoke(DelegatingMethodAccessorImpl.java:43)
> at java.lang.reflect.Method.invoke(Method.java:606)
> at org.apache.maven.surefire.util.ReflectionUtils.invokeMethodWithArray(ReflectionUtils.java:189)
> at org.apache.maven.surefire.booter.ProviderFactory$ProviderProxy.invoke(ProviderFactory.java:165)
> at org.apache.maven.surefire.booter.ProviderFactory.invokeProvider(ProviderFactory.java:85)
> at org.apache.maven.surefire.booter.ForkedBooter.runSuitesInProcess(ForkedBooter.java:103)
> at org.apache.maven.surefire.booter.ForkedBooter.main(ForkedBooter.java:74)
>
>
> zt



-- 
白清杰 (Born Bai)

Mail: linuxbqj@gmail.com
Mime
  • Unnamed multipart/alternative (inline, 8-Bit, 0 bytes)
View raw message