cloudstack-users-cn mailing list archives

Site index · List index
Message view « Date » · « Thread »
Top « Date » · « Thread »
From 贾丛飞 <xkjcf....@gmail.com>
Subject Cloudstack 4.4 在ubuntu下的编译错误
Date Tue, 21 Oct 2014 13:03:56 GMT
我在ubuntu 14.4 server amd64下编译Cloudstack 4.4时,遇到了以下错误。下边是
打印出来的三段错误。请问大家遇到过么?多谢多谢
编译这个环境主要是为了为cloudstack添加一个plug
in。

---丛飞



Tests run: 2, Failures: 0, Errors: 0, Skipped: 0, Time elapsed: 0.003 sec
Running org.apache.cloudstack.networkoffering.CreateNetworkOfferingTest
Tests run: 10, Failures: 0, Errors: 0, Skipped: 0, Time elapsed: 5.828 sec

Results :

Failed tests:
runUploadSslCertBadkeyAlgo(org.apache.cloudstack.network.lb.CertServiceTest)
  runUploadSslCertBadkeyPair(org.apache.cloudstack.network.lb.CertServiceTest)
  runUploadSslCertBadChain(org.apache.cloudstack.network.lb.CertServiceTest)
  runUploadSslCertNoRootCert(org.apache.cloudstack.network.lb.CertServiceTest)
  runUploadSslCertNoChain(org.apache.cloudstack.network.lb.CertServiceTest)

Tests in error:
  runUploadSslCertWithCAChain(org.apache.cloudstack.network.lb.CertServiceTest):
Error parsing certificate data Certificate expired or not valid
  runUploadSslCertSelfSignedNoPassword(org.apache.cloudstack.network.lb.CertServiceTest):
Error parsing certificate data Certificate expired or not valid
  runUploadSslCertSelfSignedWithPassword(org.apache.cloudstack.network.lb.CertServiceTest):
Error parsing certificate data Certificate expired or not valid

Tests run: 139, Failures: 5, Errors: 3, Skipped: 1



[INFO] Apache CloudStack Cloud Engine Schema Component ... SUCCESS [5.488s]
[INFO] Apache CloudStack Framework - Jobs ................ SUCCESS [6.644s]
[INFO] Apache CloudStack Cloud Engine Internal Components API  SUCCESS [1.240s]
[INFO] Apache CloudStack Server .......................... FAILURE [35.973s]
[INFO] Apache CloudStack Usage Server .................... SKIPPED
[INFO] Apache XenSource XAPI ............................. SKIPPED
[INFO] Apache CloudStack Cloud Engine Orchestration Component  SKIPPED
[INFO] Apache CloudStack Cloud Services .................. SKIPPED
[INFO] Apache CloudStack Secondary Storage ............... SKIPPED

[ERROR] Failed to execute goal
org.apache.maven.plugins:maven-surefire-plugin:2.12:test
(default-test) on project cloud-server: There are test failures.
[ERROR]
[ERROR] Please refer to
/home/wiki/cloudstack_bak/server/target/surefire-reports for the
individual test results.
[ERROR] -> [Help 1]
[ERROR]

Mime
View raw message