cloudstack-users-cn mailing list archives

Site index · List index
Message view « Date » · « Thread »
Top « Date » · « Thread »
From "Wwei@landhightech.com" <W...@landhightech.com>
Subject CloudStack4.4.0编译Non-OSS VMware Base FAILURE
Date Fri, 24 Oct 2014 01:10:24 GMT
我在Centos 6.5下,使用CloudStack4.4.0编译Non-OSS时,出现如下错误:  
请教一下大家如何解决,麻烦大家了
NFO] Apache CloudStack Plugin - Juniper SRX ............. SUCCESS [  1.365 s]
[INFO] Apache CloudStack VMware Base ...................... FAILURE [  6.536 s]
[INFO] Apache CloudStack Plugin - Hypervisor VMware ....... SKIPPED
[INFO] Apache CloudStack Plugin - Cisco VNMC .............. SKIPPED
[INFO] Apache CloudStack Plugin - MySQL HA Strategy ....... SKIPPED
[INFO] Apache CloudStack Framework - Spring Module ........ SKIPPED
[INFO] Apache CloudStack Secondary Storage Controller ..... SKIPPED
[INFO] Apache CloudStack Client UI ........................ SKIPPED
[INFO] Apache CloudStack Console Proxy - RDP Client ....... SKIPPED
[INFO] Apache CloudStack Console Proxy .................... SKIPPED
[INFO] Apache CloudStack Console Proxy - Server ........... SKIPPED
[INFO] Apache CloudStack Framework - QuickCloud ........... SKIPPED
[INFO] ------------------------------------------------------------------------
[INFO] BUILD FAILURE
[ERROR] Failed to execute goal org.apache.maven.plugins:maven-compiler-plugin:2.5.1:compile
(default-compile) on project cloud-vmware-base: Compilation failure: Compilation failure:
[ERROR] /usr/apache-cloudstack-4.4.0-src/vmware-base/src/com/cloud/hypervisor/vmware/util/VmwareClient.java:[36,23]
error: cannot find symbol
[ERROR] symbol:   class InvalidCollectorVersionFaultMsg
[ERROR] location: package com.vmware.vim25
[ERROR] /usr/apache-cloudstack-4.4.0-src/vmware-base/src/com/cloud/hypervisor/vmware/util/VmwareClient.java:[37,23]
error: cannot find symbol
[ERROR] symbol:   class InvalidPropertyFaultMsg
[ERROR] location: package com.vmware.vim25
[ERROR] /usr/apache-cloudstack-4.4.0-src/vmware-base/src/com/cloud/hypervisor/vmware/util/VmwareClient.java:[49,23]
error: cannot find symbol
[ERROR] symbol:   class RuntimeFaultFaultMsg
[ERROR] location: package com.vmware.vim25
[ERROR] 



Wwei@landhightech.com
Mime
  • Unnamed multipart/alternative (inline, None, 0 bytes)
View raw message