cloudstack-issues mailing list archives

Site index · List index
Message view « Date » · « Thread »
Top « Date » · « Thread »
From "ASF GitHub Bot (JIRA)" <j...@apache.org>
Subject [jira] [Commented] (CLOUDSTACK-9389) [Automation ]modifying integration/smoke/test_routers_network_ops.py
Date Fri, 27 May 2016 13:01:12 GMT

    [ https://issues.apache.org/jira/browse/CLOUDSTACK-9389?page=com.atlassian.jira.plugin.system.issuetabpanels:comment-tabpanel&focusedCommentId=15304032#comment-15304032
] 

ASF GitHub Bot commented on CLOUDSTACK-9389:
--------------------------------------------

Github user swill commented on the pull request:

    https://github.com/apache/cloudstack/pull/1563#issuecomment-222140055
  
    
    
    ### CI RESULTS
    
    ```
    Tests Run: 78
      Skipped: 0
       Failed: 2
       Errors: 4
     Duration: 7h 21m 57s
    ```
    
    **Summary of the problem(s):**
    ```
    ERROR: test suite for <class 'integration.smoke.test_internal_lb.TestInternalLb'>
    ----------------------------------------------------------------------
    Traceback (most recent call last):
      File "/usr/lib/python2.7/site-packages/nose-1.3.7-py2.7.egg/nose/suite.py", line 209,
in run
        self.setUp()
      File "/usr/lib/python2.7/site-packages/nose-1.3.7-py2.7.egg/nose/suite.py", line 292,
in setUp
        self.setupContext(ancestor)
      File "/usr/lib/python2.7/site-packages/nose-1.3.7-py2.7.egg/nose/suite.py", line 315,
in setupContext
        try_run(context, names)
      File "/usr/lib/python2.7/site-packages/nose-1.3.7-py2.7.egg/nose/util.py", line 471,
in try_run
        return func()
      File "/data/git/cs1/cloudstack/test/integration/smoke/test_internal_lb.py", line 296,
in setUpClass
        cls.template.download(cls.apiclient)
      File "/usr/lib/python2.7/site-packages/marvin/lib/base.py", line 1350, in download
        elif 'Downloaded' in template.status:
    TypeError: argument of type 'NoneType' is not iterable
    ----------------------------------------------------------------------
    Additional details in: /tmp/MarvinLogs/test_network_IGZRHU/results.txt
    ```
    
    ```
    ERROR: test suite for <class 'integration.smoke.test_vpc_vpn.TestRVPCSite2SiteVpn'>
    ----------------------------------------------------------------------
    Traceback (most recent call last):
      File "/usr/lib/python2.7/site-packages/nose-1.3.7-py2.7.egg/nose/suite.py", line 209,
in run
        self.setUp()
      File "/usr/lib/python2.7/site-packages/nose-1.3.7-py2.7.egg/nose/suite.py", line 292,
in setUp
        self.setupContext(ancestor)
      File "/usr/lib/python2.7/site-packages/nose-1.3.7-py2.7.egg/nose/suite.py", line 315,
in setupContext
        try_run(context, names)
      File "/usr/lib/python2.7/site-packages/nose-1.3.7-py2.7.egg/nose/util.py", line 471,
in try_run
        return func()
      File "/data/git/cs1/cloudstack/test/integration/smoke/test_vpc_vpn.py", line 835, in
setUpClass
        cls.template.download(cls.apiclient)
      File "/usr/lib/python2.7/site-packages/marvin/lib/base.py", line 1350, in download
        elif 'Downloaded' in template.status:
    TypeError: argument of type 'NoneType' is not iterable
    ----------------------------------------------------------------------
    Additional details in: /tmp/MarvinLogs/test_network_IGZRHU/results.txt
    ```
    
    ```
    ERROR: test suite for <class 'integration.smoke.test_vpc_vpn.TestVpcRemoteAccessVpn'>
    ----------------------------------------------------------------------
    Traceback (most recent call last):
      File "/usr/lib/python2.7/site-packages/nose-1.3.7-py2.7.egg/nose/suite.py", line 209,
in run
        self.setUp()
      File "/usr/lib/python2.7/site-packages/nose-1.3.7-py2.7.egg/nose/suite.py", line 292,
in setUp
        self.setupContext(ancestor)
      File "/usr/lib/python2.7/site-packages/nose-1.3.7-py2.7.egg/nose/suite.py", line 315,
in setupContext
        try_run(context, names)
      File "/usr/lib/python2.7/site-packages/nose-1.3.7-py2.7.egg/nose/util.py", line 471,
in try_run
        return func()
      File "/data/git/cs1/cloudstack/test/integration/smoke/test_vpc_vpn.py", line 293, in
setUpClass
        cls.template.download(cls.apiclient)
      File "/usr/lib/python2.7/site-packages/marvin/lib/base.py", line 1350, in download
        elif 'Downloaded' in template.status:
    TypeError: argument of type 'NoneType' is not iterable
    ----------------------------------------------------------------------
    Additional details in: /tmp/MarvinLogs/test_network_IGZRHU/results.txt
    ```
    
    ```
    ERROR: test suite for <class 'integration.smoke.test_vpc_vpn.TestVpcSite2SiteVpn'>
    ----------------------------------------------------------------------
    Traceback (most recent call last):
      File "/usr/lib/python2.7/site-packages/nose-1.3.7-py2.7.egg/nose/suite.py", line 209,
in run
        self.setUp()
      File "/usr/lib/python2.7/site-packages/nose-1.3.7-py2.7.egg/nose/suite.py", line 292,
in setUp
        self.setupContext(ancestor)
      File "/usr/lib/python2.7/site-packages/nose-1.3.7-py2.7.egg/nose/suite.py", line 315,
in setupContext
        try_run(context, names)
      File "/usr/lib/python2.7/site-packages/nose-1.3.7-py2.7.egg/nose/util.py", line 471,
in try_run
        return func()
      File "/data/git/cs1/cloudstack/test/integration/smoke/test_vpc_vpn.py", line 472, in
setUpClass
        cls.template.download(cls.apiclient)
      File "/usr/lib/python2.7/site-packages/marvin/lib/base.py", line 1350, in download
        elif 'Downloaded' in template.status:
    TypeError: argument of type 'NoneType' is not iterable
    ----------------------------------------------------------------------
    Additional details in: /tmp/MarvinLogs/test_network_IGZRHU/results.txt
    ```
    
    ```
    FAIL: Test redundant router internals
    ----------------------------------------------------------------------
    Traceback (most recent call last):
      File "/data/git/cs1/cloudstack/test/integration/smoke/test_routers_network_ops.py",
line 831, in test_01_isolate_network_FW_PF_default_routes_egress_true
        "Ping to outside world from VM should be successful!"
    AssertionError: Ping to outside world from VM should be successful!
    ----------------------------------------------------------------------
    Additional details in: /tmp/MarvinLogs/test_network_IGZRHU/results.txt
    ```
    
    ```
    FAIL: Test redundant router internals
    ----------------------------------------------------------------------
    Traceback (most recent call last):
      File "/data/git/cs1/cloudstack/test/integration/smoke/test_routers_network_ops.py",
line 279, in test_01_RVR_Network_FW_PF_SSH_default_routes_egress_true
        "Ping to outside world from VM should be successful!"
    AssertionError: Ping to outside world from VM should be successful!
    ----------------------------------------------------------------------
    Additional details in: /tmp/MarvinLogs/test_network_IGZRHU/results.txt
    ```
    
    
    
    **Associated Uploads**
    
    **`/tmp/MarvinLogs/DeployDataCenter__May_26_2016_18_29_46_OK3MA3:`**
    * [dc_entries.obj](https://objects-east.cloud.ca/v1/e465abe2f9ae4478b9fff416eab61bd9/PR1563/tmp/MarvinLogs/DeployDataCenter__May_26_2016_18_29_46_OK3MA3/dc_entries.obj)
    * [failed_plus_exceptions.txt](https://objects-east.cloud.ca/v1/e465abe2f9ae4478b9fff416eab61bd9/PR1563/tmp/MarvinLogs/DeployDataCenter__May_26_2016_18_29_46_OK3MA3/failed_plus_exceptions.txt)
    * [runinfo.txt](https://objects-east.cloud.ca/v1/e465abe2f9ae4478b9fff416eab61bd9/PR1563/tmp/MarvinLogs/DeployDataCenter__May_26_2016_18_29_46_OK3MA3/runinfo.txt)
    
    **`/tmp/MarvinLogs/test_network_IGZRHU:`**
    * [failed_plus_exceptions.txt](https://objects-east.cloud.ca/v1/e465abe2f9ae4478b9fff416eab61bd9/PR1563/tmp/MarvinLogs/test_network_IGZRHU/failed_plus_exceptions.txt)
    * [results.txt](https://objects-east.cloud.ca/v1/e465abe2f9ae4478b9fff416eab61bd9/PR1563/tmp/MarvinLogs/test_network_IGZRHU/results.txt)
    * [runinfo.txt](https://objects-east.cloud.ca/v1/e465abe2f9ae4478b9fff416eab61bd9/PR1563/tmp/MarvinLogs/test_network_IGZRHU/runinfo.txt)
    
    **`/tmp/MarvinLogs/test_vpc_routers_G2CQ7O:`**
    * [failed_plus_exceptions.txt](https://objects-east.cloud.ca/v1/e465abe2f9ae4478b9fff416eab61bd9/PR1563/tmp/MarvinLogs/test_vpc_routers_G2CQ7O/failed_plus_exceptions.txt)
    * [results.txt](https://objects-east.cloud.ca/v1/e465abe2f9ae4478b9fff416eab61bd9/PR1563/tmp/MarvinLogs/test_vpc_routers_G2CQ7O/results.txt)
    * [runinfo.txt](https://objects-east.cloud.ca/v1/e465abe2f9ae4478b9fff416eab61bd9/PR1563/tmp/MarvinLogs/test_vpc_routers_G2CQ7O/runinfo.txt)
    
    
    Uploads will be available until `2016-07-27 02:00:00 +0200 CEST`
    
    *Comment created by [`upr comment`](https://github.com/cloudops/upr).*



> [Automation ]modifying integration/smoke/test_routers_network_ops.py
> --------------------------------------------------------------------
>
>                 Key: CLOUDSTACK-9389
>                 URL: https://issues.apache.org/jira/browse/CLOUDSTACK-9389
>             Project: CloudStack
>          Issue Type: Bug
>      Security Level: Public(Anyone can view this level - this is the default.) 
>          Components: Automation
>            Reporter: prashant kumar mishra
>            Assignee: prashant kumar mishra
>
> Some test cases were failing due to invalid check_string , proposing following modifications
 
> 1-Moving check_string to test_data.py  
> 2-Since ping cmd reply is OS dependent ,for  default templates os type  CentOS changing
check_string  from "3 packets received" to  "3 received" 
> [root@BPKxDmS ~]# ping -c 3 8.8.8.8
> PING 8.8.8.8 (8.8.8.8) 56(84) bytes of data.
> 64 bytes from 8.8.8.8: icmp_seq=1 ttl=52 time=16.9 ms
> 64 bytes from 8.8.8.8: icmp_seq=2 ttl=52 time=16.7 ms
> 64 bytes from 8.8.8.8: icmp_seq=3 ttl=52 time=17.0 ms
> --- 8.8.8.8 ping statistics ---
> 3 packets transmitted, 3 received, 0% packet loss, time 2020ms
> rtt min/avg/max/mdev = 16.720/16.896/17.015/0.196 ms



--
This message was sent by Atlassian JIRA
(v6.3.4#6332)

Mime
View raw message