cloudstack-issues mailing list archives

Site index · List index
Message view « Date » · « Thread »
Top « Date » · « Thread »
From "ASF GitHub Bot (JIRA)" <j...@apache.org>
Subject [jira] [Commented] (CLOUDSTACK-8870) external network device usage monitor runs even when there are no external devices
Date Thu, 26 May 2016 01:58:12 GMT

    [ https://issues.apache.org/jira/browse/CLOUDSTACK-8870?page=com.atlassian.jira.plugin.system.issuetabpanels:comment-tabpanel&focusedCommentId=15301299#comment-15301299
] 

ASF GitHub Bot commented on CLOUDSTACK-8870:
--------------------------------------------

Github user swill commented on the pull request:

    https://github.com/apache/cloudstack/pull/846#issuecomment-221757982
  
    
    
    ### CI RESULTS
    
    ```
    Tests Run: 82
      Skipped: 0
       Failed: 0
       Errors: 3
     Duration: 8h 33m 42s
    ```
    
    **Summary of the problem(s):**
    ```
    ERROR: test suite for <class 'integration.smoke.test_vpc_vpn.TestRVPCSite2SiteVpn'>
    ----------------------------------------------------------------------
    Traceback (most recent call last):
      File "/usr/lib/python2.7/site-packages/nose-1.3.7-py2.7.egg/nose/suite.py", line 209,
in run
        self.setUp()
      File "/usr/lib/python2.7/site-packages/nose-1.3.7-py2.7.egg/nose/suite.py", line 292,
in setUp
        self.setupContext(ancestor)
      File "/usr/lib/python2.7/site-packages/nose-1.3.7-py2.7.egg/nose/suite.py", line 315,
in setupContext
        try_run(context, names)
      File "/usr/lib/python2.7/site-packages/nose-1.3.7-py2.7.egg/nose/util.py", line 471,
in try_run
        return func()
      File "/data/git/cs1/cloudstack/test/integration/smoke/test_vpc_vpn.py", line 835, in
setUpClass
        cls.template.download(cls.apiclient)
      File "/usr/lib/python2.7/site-packages/marvin/lib/base.py", line 1350, in download
        elif 'Downloaded' in template.status:
    TypeError: argument of type 'NoneType' is not iterable
    ----------------------------------------------------------------------
    Additional details in: /tmp/MarvinLogs/test_network_VKMDK0/results.txt
    ```
    
    ```
    ERROR: test suite for <class 'integration.smoke.test_vpc_vpn.TestVpcRemoteAccessVpn'>
    ----------------------------------------------------------------------
    Traceback (most recent call last):
      File "/usr/lib/python2.7/site-packages/nose-1.3.7-py2.7.egg/nose/suite.py", line 209,
in run
        self.setUp()
      File "/usr/lib/python2.7/site-packages/nose-1.3.7-py2.7.egg/nose/suite.py", line 292,
in setUp
        self.setupContext(ancestor)
      File "/usr/lib/python2.7/site-packages/nose-1.3.7-py2.7.egg/nose/suite.py", line 315,
in setupContext
        try_run(context, names)
      File "/usr/lib/python2.7/site-packages/nose-1.3.7-py2.7.egg/nose/util.py", line 471,
in try_run
        return func()
      File "/data/git/cs1/cloudstack/test/integration/smoke/test_vpc_vpn.py", line 293, in
setUpClass
        cls.template.download(cls.apiclient)
      File "/usr/lib/python2.7/site-packages/marvin/lib/base.py", line 1350, in download
        elif 'Downloaded' in template.status:
    TypeError: argument of type 'NoneType' is not iterable
    ----------------------------------------------------------------------
    Additional details in: /tmp/MarvinLogs/test_network_VKMDK0/results.txt
    ```
    
    ```
    ERROR: test suite for <class 'integration.smoke.test_vpc_vpn.TestVpcSite2SiteVpn'>
    ----------------------------------------------------------------------
    Traceback (most recent call last):
      File "/usr/lib/python2.7/site-packages/nose-1.3.7-py2.7.egg/nose/suite.py", line 209,
in run
        self.setUp()
      File "/usr/lib/python2.7/site-packages/nose-1.3.7-py2.7.egg/nose/suite.py", line 292,
in setUp
        self.setupContext(ancestor)
      File "/usr/lib/python2.7/site-packages/nose-1.3.7-py2.7.egg/nose/suite.py", line 315,
in setupContext
        try_run(context, names)
      File "/usr/lib/python2.7/site-packages/nose-1.3.7-py2.7.egg/nose/util.py", line 471,
in try_run
        return func()
      File "/data/git/cs1/cloudstack/test/integration/smoke/test_vpc_vpn.py", line 472, in
setUpClass
        cls.template.download(cls.apiclient)
      File "/usr/lib/python2.7/site-packages/marvin/lib/base.py", line 1350, in download
        elif 'Downloaded' in template.status:
    TypeError: argument of type 'NoneType' is not iterable
    ----------------------------------------------------------------------
    Additional details in: /tmp/MarvinLogs/test_network_VKMDK0/results.txt
    ```
    
    
    
    **Associated Uploads**
    
    **`/tmp/MarvinLogs/DeployDataCenter__May_25_2016_19_10_57_8DI3FD:`**
    * [dc_entries.obj](https://objects-east.cloud.ca/v1/e465abe2f9ae4478b9fff416eab61bd9/PR846/tmp/MarvinLogs/DeployDataCenter__May_25_2016_19_10_57_8DI3FD/dc_entries.obj)
    * [failed_plus_exceptions.txt](https://objects-east.cloud.ca/v1/e465abe2f9ae4478b9fff416eab61bd9/PR846/tmp/MarvinLogs/DeployDataCenter__May_25_2016_19_10_57_8DI3FD/failed_plus_exceptions.txt)
    * [runinfo.txt](https://objects-east.cloud.ca/v1/e465abe2f9ae4478b9fff416eab61bd9/PR846/tmp/MarvinLogs/DeployDataCenter__May_25_2016_19_10_57_8DI3FD/runinfo.txt)
    
    **`/tmp/MarvinLogs/test_network_VKMDK0:`**
    * [failed_plus_exceptions.txt](https://objects-east.cloud.ca/v1/e465abe2f9ae4478b9fff416eab61bd9/PR846/tmp/MarvinLogs/test_network_VKMDK0/failed_plus_exceptions.txt)
    * [results.txt](https://objects-east.cloud.ca/v1/e465abe2f9ae4478b9fff416eab61bd9/PR846/tmp/MarvinLogs/test_network_VKMDK0/results.txt)
    * [runinfo.txt](https://objects-east.cloud.ca/v1/e465abe2f9ae4478b9fff416eab61bd9/PR846/tmp/MarvinLogs/test_network_VKMDK0/runinfo.txt)
    
    **`/tmp/MarvinLogs/test_vpc_routers_PXO5U1:`**
    * [failed_plus_exceptions.txt](https://objects-east.cloud.ca/v1/e465abe2f9ae4478b9fff416eab61bd9/PR846/tmp/MarvinLogs/test_vpc_routers_PXO5U1/failed_plus_exceptions.txt)
    * [results.txt](https://objects-east.cloud.ca/v1/e465abe2f9ae4478b9fff416eab61bd9/PR846/tmp/MarvinLogs/test_vpc_routers_PXO5U1/results.txt)
    * [runinfo.txt](https://objects-east.cloud.ca/v1/e465abe2f9ae4478b9fff416eab61bd9/PR846/tmp/MarvinLogs/test_vpc_routers_PXO5U1/runinfo.txt)
    
    
    Uploads will be available until `2016-07-26 02:00:00 +0200 CEST`
    
    *Comment created by [`upr comment`](https://github.com/cloudops/upr).*



> external network device usage monitor runs even when there are no external devices
> ----------------------------------------------------------------------------------
>
>                 Key: CLOUDSTACK-8870
>                 URL: https://issues.apache.org/jira/browse/CLOUDSTACK-8870
>             Project: CloudStack
>          Issue Type: Bug
>      Security Level: Public(Anyone can view this level - this is the default.) 
>            Reporter: Kishan Kavala
>            Assignee: Kishan Kavala
>




--
This message was sent by Atlassian JIRA
(v6.3.4#6332)

Mime
View raw message