cloudstack-issues mailing list archives

Site index · List index
Message view « Date » · « Thread »
Top « Date » · « Thread »
From "ASF GitHub Bot (JIRA)" <j...@apache.org>
Subject [jira] [Commented] (CLOUDSTACK-8715) Add support for qemu-guest-agent to libvirt provider
Date Fri, 20 May 2016 04:05:13 GMT

    [ https://issues.apache.org/jira/browse/CLOUDSTACK-8715?page=com.atlassian.jira.plugin.system.issuetabpanels:comment-tabpanel&focusedCommentId=15292661#comment-15292661
] 

ASF GitHub Bot commented on CLOUDSTACK-8715:
--------------------------------------------

Github user swill commented on the pull request:

    https://github.com/apache/cloudstack/pull/1545#issuecomment-220512458
  
    
    
    ### CI RESULTS
    
    ```
    Tests Run: 78
      Skipped: 0
       Failed: 0
       Errors: 4
     Duration: 7h 47m 49s
    ```
    
    **Summary of the problem(s):**
    ```
    ERROR: test suite for <class 'integration.smoke.test_internal_lb.TestInternalLb'>
    ----------------------------------------------------------------------
    Traceback (most recent call last):
      File "/usr/lib/python2.7/site-packages/nose-1.3.7-py2.7.egg/nose/suite.py", line 209,
in run
        self.setUp()
      File "/usr/lib/python2.7/site-packages/nose-1.3.7-py2.7.egg/nose/suite.py", line 292,
in setUp
        self.setupContext(ancestor)
      File "/usr/lib/python2.7/site-packages/nose-1.3.7-py2.7.egg/nose/suite.py", line 315,
in setupContext
        try_run(context, names)
      File "/usr/lib/python2.7/site-packages/nose-1.3.7-py2.7.egg/nose/util.py", line 471,
in try_run
        return func()
      File "/data/git/cs1/cloudstack/test/integration/smoke/test_internal_lb.py", line 296,
in setUpClass
        cls.template.download(cls.apiclient)
      File "/usr/lib/python2.7/site-packages/marvin/lib/base.py", line 1350, in download
        elif 'Downloaded' in template.status:
    TypeError: argument of type 'NoneType' is not iterable
    ----------------------------------------------------------------------
    Additional details in: /tmp/MarvinLogs/test_network_YJVJO9/results.txt
    ```
    
    ```
    ERROR: test suite for <class 'integration.smoke.test_vpc_vpn.TestRVPCSite2SiteVpn'>
    ----------------------------------------------------------------------
    Traceback (most recent call last):
      File "/usr/lib/python2.7/site-packages/nose-1.3.7-py2.7.egg/nose/suite.py", line 209,
in run
        self.setUp()
      File "/usr/lib/python2.7/site-packages/nose-1.3.7-py2.7.egg/nose/suite.py", line 292,
in setUp
        self.setupContext(ancestor)
      File "/usr/lib/python2.7/site-packages/nose-1.3.7-py2.7.egg/nose/suite.py", line 315,
in setupContext
        try_run(context, names)
      File "/usr/lib/python2.7/site-packages/nose-1.3.7-py2.7.egg/nose/util.py", line 471,
in try_run
        return func()
      File "/data/git/cs1/cloudstack/test/integration/smoke/test_vpc_vpn.py", line 835, in
setUpClass
        cls.template.download(cls.apiclient)
      File "/usr/lib/python2.7/site-packages/marvin/lib/base.py", line 1350, in download
        elif 'Downloaded' in template.status:
    TypeError: argument of type 'NoneType' is not iterable
    ----------------------------------------------------------------------
    Additional details in: /tmp/MarvinLogs/test_network_YJVJO9/results.txt
    ```
    
    ```
    ERROR: test suite for <class 'integration.smoke.test_vpc_vpn.TestVpcRemoteAccessVpn'>
    ----------------------------------------------------------------------
    Traceback (most recent call last):
      File "/usr/lib/python2.7/site-packages/nose-1.3.7-py2.7.egg/nose/suite.py", line 209,
in run
        self.setUp()
      File "/usr/lib/python2.7/site-packages/nose-1.3.7-py2.7.egg/nose/suite.py", line 292,
in setUp
        self.setupContext(ancestor)
      File "/usr/lib/python2.7/site-packages/nose-1.3.7-py2.7.egg/nose/suite.py", line 315,
in setupContext
        try_run(context, names)
      File "/usr/lib/python2.7/site-packages/nose-1.3.7-py2.7.egg/nose/util.py", line 471,
in try_run
        return func()
      File "/data/git/cs1/cloudstack/test/integration/smoke/test_vpc_vpn.py", line 293, in
setUpClass
        cls.template.download(cls.apiclient)
      File "/usr/lib/python2.7/site-packages/marvin/lib/base.py", line 1350, in download
        elif 'Downloaded' in template.status:
    TypeError: argument of type 'NoneType' is not iterable
    ----------------------------------------------------------------------
    Additional details in: /tmp/MarvinLogs/test_network_YJVJO9/results.txt
    ```
    
    ```
    ERROR: test suite for <class 'integration.smoke.test_vpc_vpn.TestVpcSite2SiteVpn'>
    ----------------------------------------------------------------------
    Traceback (most recent call last):
      File "/usr/lib/python2.7/site-packages/nose-1.3.7-py2.7.egg/nose/suite.py", line 209,
in run
        self.setUp()
      File "/usr/lib/python2.7/site-packages/nose-1.3.7-py2.7.egg/nose/suite.py", line 292,
in setUp
        self.setupContext(ancestor)
      File "/usr/lib/python2.7/site-packages/nose-1.3.7-py2.7.egg/nose/suite.py", line 315,
in setupContext
        try_run(context, names)
      File "/usr/lib/python2.7/site-packages/nose-1.3.7-py2.7.egg/nose/util.py", line 471,
in try_run
        return func()
      File "/data/git/cs1/cloudstack/test/integration/smoke/test_vpc_vpn.py", line 472, in
setUpClass
        cls.template.download(cls.apiclient)
      File "/usr/lib/python2.7/site-packages/marvin/lib/base.py", line 1350, in download
        elif 'Downloaded' in template.status:
    TypeError: argument of type 'NoneType' is not iterable
    ----------------------------------------------------------------------
    Additional details in: /tmp/MarvinLogs/test_network_YJVJO9/results.txt
    ```
    
    
    
    **Associated Uploads**
    
    **`/tmp/MarvinLogs/DeployDataCenter__May_19_2016_19_37_29_UK7LQG:`**
    * [dc_entries.obj](https://objects-east.cloud.ca/v1/e465abe2f9ae4478b9fff416eab61bd9/PR1545/tmp/MarvinLogs/DeployDataCenter__May_19_2016_19_37_29_UK7LQG/dc_entries.obj)
    * [failed_plus_exceptions.txt](https://objects-east.cloud.ca/v1/e465abe2f9ae4478b9fff416eab61bd9/PR1545/tmp/MarvinLogs/DeployDataCenter__May_19_2016_19_37_29_UK7LQG/failed_plus_exceptions.txt)
    * [runinfo.txt](https://objects-east.cloud.ca/v1/e465abe2f9ae4478b9fff416eab61bd9/PR1545/tmp/MarvinLogs/DeployDataCenter__May_19_2016_19_37_29_UK7LQG/runinfo.txt)
    
    **`/tmp/MarvinLogs/test_network_YJVJO9:`**
    * [failed_plus_exceptions.txt](https://objects-east.cloud.ca/v1/e465abe2f9ae4478b9fff416eab61bd9/PR1545/tmp/MarvinLogs/test_network_YJVJO9/failed_plus_exceptions.txt)
    * [results.txt](https://objects-east.cloud.ca/v1/e465abe2f9ae4478b9fff416eab61bd9/PR1545/tmp/MarvinLogs/test_network_YJVJO9/results.txt)
    * [runinfo.txt](https://objects-east.cloud.ca/v1/e465abe2f9ae4478b9fff416eab61bd9/PR1545/tmp/MarvinLogs/test_network_YJVJO9/runinfo.txt)
    
    **`/tmp/MarvinLogs/test_vpc_routers_NDLJQN:`**
    * [failed_plus_exceptions.txt](https://objects-east.cloud.ca/v1/e465abe2f9ae4478b9fff416eab61bd9/PR1545/tmp/MarvinLogs/test_vpc_routers_NDLJQN/failed_plus_exceptions.txt)
    * [results.txt](https://objects-east.cloud.ca/v1/e465abe2f9ae4478b9fff416eab61bd9/PR1545/tmp/MarvinLogs/test_vpc_routers_NDLJQN/results.txt)
    * [runinfo.txt](https://objects-east.cloud.ca/v1/e465abe2f9ae4478b9fff416eab61bd9/PR1545/tmp/MarvinLogs/test_vpc_routers_NDLJQN/runinfo.txt)
    
    
    Uploads will be available until `2016-07-20 02:00:00 +0200 CEST`
    
    *Comment created by [`upr comment`](https://github.com/cloudops/upr).*



> Add support for qemu-guest-agent to libvirt provider
> ----------------------------------------------------
>
>                 Key: CLOUDSTACK-8715
>                 URL: https://issues.apache.org/jira/browse/CLOUDSTACK-8715
>             Project: CloudStack
>          Issue Type: New Feature
>      Security Level: Public(Anyone can view this level - this is the default.) 
>          Components: KVM
>            Reporter: Sten Spans
>            Assignee: Wido den Hollander
>              Labels: kvm, libvirt, qemu, systemvm
>             Fix For: Future
>
>
> The qemu guest agent is a newer part of qemu/kvm/libvirt which exposes quite a lot of
useful functionality, which can only be provided by having an agent on the VM. This includes
things like freezing/thawing filesystems (for backups), reading files on the guest, listing
interfaces / ip addresses, etc.
> This feature has been requested by users, but is currently not implemented.
> http://users.cloudstack.apache.narkive.com/3TTmy3zj/enabling-qemu-guest-agent
> The first change needed is to add the following to the XML generated for KVM virtual
machines,:
> <channel type='unix'>
>   <source mode='bind'/>
>   <target type='virtio' name='org.qemu.guest_agent.0'/>
> </channel>
> This provides the communication channel between libvirt and the agent on the host. All
in all a pretty simple change to LibvirtComputingResource.java / LibvirtVMDef.java
> Secondly the qemu-guest-agent package needs to be added to the systemvm template.



--
This message was sent by Atlassian JIRA
(v6.3.4#6332)

Mime
View raw message