cloudstack-issues mailing list archives

Site index · List index
Message view « Date » · « Thread »
Top « Date » · « Thread »
From "ASF GitHub Bot (JIRA)" <j...@apache.org>
Subject [jira] [Commented] (CLOUDSTACK-9305) Cloudstack Usage breaks with DB HA
Date Fri, 29 Apr 2016 02:46:12 GMT

    [ https://issues.apache.org/jira/browse/CLOUDSTACK-9305?page=com.atlassian.jira.plugin.system.issuetabpanels:comment-tabpanel&focusedCommentId=15263441#comment-15263441
] 

ASF GitHub Bot commented on CLOUDSTACK-9305:
--------------------------------------------

Github user swill commented on the pull request:

    https://github.com/apache/cloudstack/pull/1433#issuecomment-215614748
  
    
    
    ### CI RESULTS
    
    ```
    Tests Run: 103
      Skipped: 0
       Failed: 3
       Errors: 2
    ```
    
    **Summary of the problem(s):**
    ```
    ERROR: Test Create/Delete a manual snap shot and verify
    ----------------------------------------------------------------------
    Traceback (most recent call last):
      File "/data/git/cs2/cloudstack/test/integration/component/test_project_usage.py", line
1376, in test_01_snapshot_usage
        snapshot = Snapshot.create(self.apiclient, volumes[0].id)
      File "/usr/lib/python2.7/site-packages/marvin/lib/base.py", line 1018, in create
        return Snapshot(apiclient.createSnapshot(cmd).__dict__)
      File "/usr/lib/python2.7/site-packages/marvin/cloudstackAPI/cloudstackAPIClient.py",
line 797, in createSnapshot
        response = self.connection.marvinRequest(command, response_type=response, method=method)
      File "/usr/lib/python2.7/site-packages/marvin/cloudstackConnection.py", line 379, in
marvinRequest
        raise e
    CloudstackAPIException: Execute cmd: createsnapshot failed, due to: errorCode: 530, errorText:KVM
Snapshot is not supported: 1
    ----------------------------------------------------------------------
    Additional details in: /tmp/MarvinLogs/test_usage_A3LTTO/results.txt
    ```
    
    ```
    ERROR: Test Create/Delete a manual snap shot and verify
    ----------------------------------------------------------------------
    Traceback (most recent call last):
      File "/data/git/cs2/cloudstack/test/integration/component/test_usage.py", line 1300,
in test_01_snapshot_usage
        snapshot = Snapshot.create(self.apiclient, volumes[0].id)
      File "/usr/lib/python2.7/site-packages/marvin/lib/base.py", line 1018, in create
        return Snapshot(apiclient.createSnapshot(cmd).__dict__)
      File "/usr/lib/python2.7/site-packages/marvin/cloudstackAPI/cloudstackAPIClient.py",
line 797, in createSnapshot
        response = self.connection.marvinRequest(command, response_type=response, method=method)
      File "/usr/lib/python2.7/site-packages/marvin/cloudstackConnection.py", line 379, in
marvinRequest
        raise e
    CloudstackAPIException: Execute cmd: createsnapshot failed, due to: errorCode: 530, errorText:KVM
Snapshot is not supported: 1
    ----------------------------------------------------------------------
    Additional details in: /tmp/MarvinLogs/test_usage_A3LTTO/results.txt
    ```
    
    ```
    FAIL: Test redundant router internals
    ----------------------------------------------------------------------
    Traceback (most recent call last):
      File "/data/git/cs2/cloudstack/test/integration/smoke/test_routers_network_ops.py",
line 290, in test_01_RVR_Network_FW_PF_SSH_default_routes_egress_true
        "Attempt to retrieve google.com index page should be successful!"
    AssertionError: Attempt to retrieve google.com index page should be successful!
    ----------------------------------------------------------------------
    Additional details in: /tmp/MarvinLogs/test_network_4ISAIJ/results.txt
    ```
    
    ```
    FAIL: test_02_vpc_privategw_static_routes (integration.smoke.test_privategw_acl.TestPrivateGwACL)
    ----------------------------------------------------------------------
    Traceback (most recent call last):
      File "/data/git/cs2/cloudstack/test/integration/smoke/test_privategw_acl.py", line 253,
in test_02_vpc_privategw_static_routes
        self.performVPCTests(vpc_off)
      File "/data/git/cs2/cloudstack/test/integration/smoke/test_privategw_acl.py", line 324,
in performVPCTests
        self.check_pvt_gw_connectivity(vm1, public_ip_1, vm2.nic[0].ipaddress)
      File "/data/git/cs2/cloudstack/test/integration/smoke/test_privategw_acl.py", line 559,
in check_pvt_gw_connectivity
        "Ping to outside world from VM should be successful"
    AssertionError: Ping to outside world from VM should be successful
    ----------------------------------------------------------------------
    Additional details in: /tmp/MarvinLogs/test_network_4ISAIJ/results.txt
    ```
    
    ```
    FAIL: test_03_vpc_privategw_restart_vpc_cleanup (integration.smoke.test_privategw_acl.TestPrivateGwACL)
    ----------------------------------------------------------------------
    Traceback (most recent call last):
      File "/data/git/cs2/cloudstack/test/integration/smoke/test_privategw_acl.py", line 265,
in test_03_vpc_privategw_restart_vpc_cleanup
        self.performVPCTests(vpc_off, True)
      File "/data/git/cs2/cloudstack/test/integration/smoke/test_privategw_acl.py", line 324,
in performVPCTests
        self.check_pvt_gw_connectivity(vm1, public_ip_1, vm2.nic[0].ipaddress)
      File "/data/git/cs2/cloudstack/test/integration/smoke/test_privategw_acl.py", line 559,
in check_pvt_gw_connectivity
        "Ping to outside world from VM should be successful"
    AssertionError: Ping to outside world from VM should be successful
    ----------------------------------------------------------------------
    Additional details in: /tmp/MarvinLogs/test_network_4ISAIJ/results.txt
    ```
    
    
    
    **Associated Uploads**
    
    **`/tmp/MarvinLogs/DeployDataCenter__Apr_28_2016_22_51_48_T2XTTQ:`**
    * [dc_entries.obj](https://objects-east.cloud.ca/v1/e465abe2f9ae4478b9fff416eab61bd9/PR1433/tmp/MarvinLogs/DeployDataCenter__Apr_28_2016_22_51_48_T2XTTQ/dc_entries.obj)
    * [failed_plus_exceptions.txt](https://objects-east.cloud.ca/v1/e465abe2f9ae4478b9fff416eab61bd9/PR1433/tmp/MarvinLogs/DeployDataCenter__Apr_28_2016_22_51_48_T2XTTQ/failed_plus_exceptions.txt)
    * [runinfo.txt](https://objects-east.cloud.ca/v1/e465abe2f9ae4478b9fff416eab61bd9/PR1433/tmp/MarvinLogs/DeployDataCenter__Apr_28_2016_22_51_48_T2XTTQ/runinfo.txt)
    
    **`/tmp/MarvinLogs/test_network_4ISAIJ:`**
    * [failed_plus_exceptions.txt](https://objects-east.cloud.ca/v1/e465abe2f9ae4478b9fff416eab61bd9/PR1433/tmp/MarvinLogs/test_network_4ISAIJ/failed_plus_exceptions.txt)
    * [results.txt](https://objects-east.cloud.ca/v1/e465abe2f9ae4478b9fff416eab61bd9/PR1433/tmp/MarvinLogs/test_network_4ISAIJ/results.txt)
    * [runinfo.txt](https://objects-east.cloud.ca/v1/e465abe2f9ae4478b9fff416eab61bd9/PR1433/tmp/MarvinLogs/test_network_4ISAIJ/runinfo.txt)
    
    **`/tmp/MarvinLogs/test_usage_A3LTTO:`**
    * [failed_plus_exceptions.txt](https://objects-east.cloud.ca/v1/e465abe2f9ae4478b9fff416eab61bd9/PR1433/tmp/MarvinLogs/test_usage_A3LTTO/failed_plus_exceptions.txt)
    * [results.txt](https://objects-east.cloud.ca/v1/e465abe2f9ae4478b9fff416eab61bd9/PR1433/tmp/MarvinLogs/test_usage_A3LTTO/results.txt)
    * [runinfo.txt](https://objects-east.cloud.ca/v1/e465abe2f9ae4478b9fff416eab61bd9/PR1433/tmp/MarvinLogs/test_usage_A3LTTO/runinfo.txt)
    
    **`/tmp/MarvinLogs/test_vpc_routers_LS4J5A:`**
    * [failed_plus_exceptions.txt](https://objects-east.cloud.ca/v1/e465abe2f9ae4478b9fff416eab61bd9/PR1433/tmp/MarvinLogs/test_vpc_routers_LS4J5A/failed_plus_exceptions.txt)
    * [results.txt](https://objects-east.cloud.ca/v1/e465abe2f9ae4478b9fff416eab61bd9/PR1433/tmp/MarvinLogs/test_vpc_routers_LS4J5A/results.txt)
    * [runinfo.txt](https://objects-east.cloud.ca/v1/e465abe2f9ae4478b9fff416eab61bd9/PR1433/tmp/MarvinLogs/test_vpc_routers_LS4J5A/runinfo.txt)
    
    
    Uploads will be available until `2016-06-29 02:00:00 +0200 CEST`
    
    *Comment created by [`upr comment`](https://github.com/cloudops/upr).*



> Cloudstack Usage breaks with DB HA
> ----------------------------------
>
>                 Key: CLOUDSTACK-9305
>                 URL: https://issues.apache.org/jira/browse/CLOUDSTACK-9305
>             Project: CloudStack
>          Issue Type: Bug
>      Security Level: Public(Anyone can view this level - this is the default.) 
>          Components: Usage
>    Affects Versions: 4.8.0
>         Environment: CentOS7
>            Reporter: Sean Lair
>
> After setting db.ha.enabled=true in db.properties, cloudstack-usage continually restarts.
 If the setting is false, cloudstack-usage starts fine.
> Found on Cloudstack 4.8.0, but may be in other versions also?



--
This message was sent by Atlassian JIRA
(v6.3.4#6332)

Mime
View raw message