cloudstack-dev mailing list archives

Site index · List index
Message view « Date » · « Thread »
Top « Date » · « Thread »
From Will Stevens <wstev...@cloudops.com>
Subject Re: Build failed in Jenkins: build-master-jdk18 #528
Date Fri, 27 May 2016 20:35:46 GMT
Sorry All, this was me.  I accidentally broke master while fixing some
merge conflicts from 4.8 -> master.

I am testing my fix now.  :)

*Will STEVENS*
Lead Developer

*CloudOps* *| *Cloud Solutions Experts
420 rue Guy *|* Montreal *|* Quebec *|* H3J 1S6
w cloudops.com *|* tw @CloudOps_

On Fri, May 27, 2016 at 4:06 PM, <jenkins@cloudstack.org> wrote:

> See <http://jenkins.buildacloud.org/job/build-master-jdk18/528/changes>
>
> Changes:
>
> [koushik] CLOUDSTACK-9180: Optimize concurrent VM deployment operation on
> same
>
> [jeff] Emit template UUID and class type over event bus when deleting
>
> [jeff] Add lsb-release dependency to mgmt server and agent on
> Debian/Ubuntu.
>
> [syed1.mushtaq] [CLOUDSTACK-9296] Start ipsec for client VPN
>
> [m] Fix URL length to 2048 for all url fields in VO
>
> [m] not needed on host table
>
> [m] API: update url field max length
>
> [Will Stevens] CLOUDSTACK-9369: Restrict default login to ldap/native users
>
> [Will Stevens] CLOUDSTACK-9376: Restrict listTemplates API with filter=all
> for root
>
> ------------------------------------------
> [...truncated 1220 lines...]
>  T E S T S
> -------------------------------------------------------
> Running com.cloud.upgrade.dao.DatabaseAccessObjectTest
> Tests run: 25, Failures: 0, Errors: 0, Skipped: 0, Time elapsed: 0.768 sec
> - in com.cloud.upgrade.dao.DatabaseAccessObjectTest
> Running com.cloud.upgrade.dao.DbUpgradeUtilsTest
> Tests run: 8, Failures: 0, Errors: 0, Skipped: 0, Time elapsed: 1.414 sec
> - in com.cloud.upgrade.dao.DbUpgradeUtilsTest
>
> Results :
>
> Tests run: 33, Failures: 0, Errors: 0, Skipped: 0
>
> [INFO]
> [INFO]
> ------------------------------------------------------------------------
> [INFO] Building Apache CloudStack Framework - Jobs 4.9.0-SNAPSHOT
> [INFO]
> ------------------------------------------------------------------------
> [INFO]
> [INFO] --- maven-clean-plugin:2.5:clean (default-clean) @
> cloud-framework-jobs ---
> [INFO] Deleting <
> http://jenkins.buildacloud.org/job/build-master-jdk18/ws/framework/jobs/target>
> (includes = [**/*], excludes = [])
> [INFO] Deleting <
> http://jenkins.buildacloud.org/job/build-master-jdk18/ws/framework/jobs>
> (includes = [target, dist], excludes = [])
> [INFO]
> [INFO] --- maven-checkstyle-plugin:2.17:check (cloudstack-checkstyle) @
> cloud-framework-jobs ---
> [INFO] Starting audit...
> Audit done.
> [INFO]
> [INFO] --- maven-remote-resources-plugin:1.3:process (default) @
> cloud-framework-jobs ---
> [INFO]
> [INFO] --- maven-resources-plugin:2.5:resources (default-resources) @
> cloud-framework-jobs ---
> [debug] execute contextualize
> [INFO] Using 'UTF-8' encoding to copy filtered resources.
> [INFO] Copying 1 resource
> [INFO] Copying 3 resources
> [INFO]
> [INFO] --- maven-compiler-plugin:3.2:compile (default-compile) @
> cloud-framework-jobs ---
> [INFO] Changes detected - recompiling the module!
> [INFO] Compiling 32 source files to <
> http://jenkins.buildacloud.org/job/build-master-jdk18/ws/framework/jobs/target/classes
> >
> [INFO]
> [INFO] --- maven-resources-plugin:2.5:testResources
> (default-testResources) @ cloud-framework-jobs ---
> [debug] execute contextualize
> [INFO] Using 'UTF-8' encoding to copy filtered resources.
> [INFO] Copying 4 resources
> [INFO] Copying 3 resources
> [INFO]
> [INFO] --- maven-compiler-plugin:3.2:testCompile (default-testCompile) @
> cloud-framework-jobs ---
> [INFO] Changes detected - recompiling the module!
> [INFO] Compiling 4 source files to <
> http://jenkins.buildacloud.org/job/build-master-jdk18/ws/framework/jobs/target/test-classes
> >
> [INFO]
> [INFO] --- maven-surefire-plugin:2.18.1:test (default-test) @
> cloud-framework-jobs ---
> [INFO]
> [INFO]
> ------------------------------------------------------------------------
> [INFO] Building Apache CloudStack Cloud Engine Internal Components API
> 4.9.0-SNAPSHOT
> [INFO]
> ------------------------------------------------------------------------
> [INFO]
> [INFO] --- maven-clean-plugin:2.5:clean (default-clean) @
> cloud-engine-components-api ---
> [INFO] Deleting <
> http://jenkins.buildacloud.org/job/build-master-jdk18/ws/engine/components-api/target>
> (includes = [**/*], excludes = [])
> [INFO] Deleting <
> http://jenkins.buildacloud.org/job/build-master-jdk18/ws/engine/components-api>
> (includes = [target, dist], excludes = [])
> [INFO]
> [INFO] --- maven-checkstyle-plugin:2.17:check (cloudstack-checkstyle) @
> cloud-engine-components-api ---
> [INFO] Starting audit...
> Audit done.
> [INFO]
> [INFO] --- maven-remote-resources-plugin:1.3:process (default) @
> cloud-engine-components-api ---
> [INFO]
> [INFO] --- maven-resources-plugin:2.5:resources (default-resources) @
> cloud-engine-components-api ---
> [debug] execute contextualize
> [INFO] Using 'UTF-8' encoding to copy filtered resources.
> [INFO] Copying 1 resource
> [INFO] Copying 3 resources
> [INFO]
> [INFO] --- maven-compiler-plugin:3.2:compile (default-compile) @
> cloud-engine-components-api ---
> [INFO] Changes detected - recompiling the module!
> [INFO] Compiling 38 source files to <
> http://jenkins.buildacloud.org/job/build-master-jdk18/ws/engine/components-api/target/classes
> >
> [INFO]
> [INFO] --- maven-resources-plugin:2.5:testResources
> (default-testResources) @ cloud-engine-components-api ---
> [debug] execute contextualize
> [INFO] Using 'UTF-8' encoding to copy filtered resources.
> [INFO] skip non existing resourceDirectory <
> http://jenkins.buildacloud.org/job/build-master-jdk18/ws/engine/components-api/test/resources
> >
> [INFO] Copying 3 resources
> [INFO]
> [INFO] --- maven-compiler-plugin:3.2:testCompile (default-testCompile) @
> cloud-engine-components-api ---
> [INFO] No sources to compile
> [INFO]
> [INFO] --- maven-surefire-plugin:2.18.1:test (default-test) @
> cloud-engine-components-api ---
> [INFO]
> [INFO]
> ------------------------------------------------------------------------
> [INFO] Building Apache CloudStack Server 4.9.0-SNAPSHOT
> [INFO]
> ------------------------------------------------------------------------
> [INFO]
> [INFO] --- maven-clean-plugin:2.5:clean (default-clean) @ cloud-server ---
> [INFO] Deleting <
> http://jenkins.buildacloud.org/job/build-master-jdk18/ws/server/target>
> (includes = [**/*], excludes = [])
> [INFO] Deleting <
> http://jenkins.buildacloud.org/job/build-master-jdk18/ws/server>
> (includes = [target, dist], excludes = [])
> [INFO]
> [INFO] --- maven-checkstyle-plugin:2.17:check (cloudstack-checkstyle) @
> cloud-server ---
> [INFO] Starting audit...
> Audit done.
> [INFO]
> [INFO] --- maven-remote-resources-plugin:1.3:process (default) @
> cloud-server ---
> [INFO]
> [INFO] --- maven-antrun-plugin:1.8:run (generate-resource) @ cloud-server
> ---
> [INFO] Executing tasks
>
> main:
>      [copy] Copying 3 files to <
> http://jenkins.buildacloud.org/job/build-master-jdk18/ws/server/target/conf
> >
>      [copy] Copying 2 files to <
> http://jenkins.buildacloud.org/job/build-master-jdk18/ws/server/target/conf
> >
> [INFO] Executed tasks
> [INFO]
> [INFO] --- maven-resources-plugin:2.5:resources (default-resources) @
> cloud-server ---
> [debug] execute contextualize
> [INFO] Using 'UTF-8' encoding to copy filtered resources.
> [INFO] Copying 30 resources
> [INFO] Copying 3 resources
> [INFO]
> [INFO] --- maven-compiler-plugin:3.2:compile (default-compile) @
> cloud-server ---
> [INFO] Changes detected - recompiling the module!
> [INFO] Compiling 411 source files to <
> http://jenkins.buildacloud.org/job/build-master-jdk18/ws/server/target/classes
> >
> [INFO] -------------------------------------------------------------
> [ERROR] COMPILATION ERROR :
> [INFO] -------------------------------------------------------------
> [ERROR] <
> http://jenkins.buildacloud.org/job/build-master-jdk18/ws/server/src/com/cloud/api/ApiServer.java>:[1006,34]
> error: cannot find symbol
> [INFO] 1 error
> [INFO] -------------------------------------------------------------
> [INFO]
> ------------------------------------------------------------------------
> [INFO] Reactor Summary:
> [INFO]
> [INFO] Apache CloudStack Developer Tools - Checkstyle Configuration
> SUCCESS [1.777s]
> [INFO] Apache CloudStack ................................. SUCCESS [2.240s]
> [INFO] Apache CloudStack Maven Conventions Parent ........ SUCCESS [9.533s]
> [INFO] Apache CloudStack Framework - Managed Context ..... SUCCESS
> [13.367s]
> [INFO] Apache CloudStack Utils ........................... SUCCESS
> [48.163s]
> [INFO] Apache CloudStack Framework ....................... SUCCESS [0.104s]
> [INFO] Apache CloudStack Framework - Event Notification .. SUCCESS
> [18.618s]
> [INFO] Apache CloudStack Framework - Configuration ....... SUCCESS
> [11.281s]
> [INFO] Apache CloudStack API ............................. SUCCESS
> [43.883s]
> [INFO] Apache CloudStack Framework - REST ................ SUCCESS [5.823s]
> [INFO] Apache CloudStack Framework - IPC ................. SUCCESS
> [11.354s]
> [INFO] Apache CloudStack Cloud Engine .................... SUCCESS [0.080s]
> [INFO] Apache CloudStack Cloud Engine API ................ SUCCESS
> [11.884s]
> [INFO] Apache CloudStack Framework - Security ............ SUCCESS [5.843s]
> [INFO] Apache CloudStack Core ............................ SUCCESS
> [32.981s]
> [INFO] Apache CloudStack Agents .......................... SUCCESS
> [15.357s]
> [INFO] Apache CloudStack Framework - Clustering .......... SUCCESS
> [11.150s]
> [INFO] Apache CloudStack Framework - Event Notification .. SUCCESS [3.966s]
> [INFO] Apache CloudStack Cloud Engine Schema Component ... SUCCESS
> [39.593s]
> [INFO] Apache CloudStack Framework - Jobs ................ SUCCESS
> [12.770s]
> [INFO] Apache CloudStack Cloud Engine Internal Components API  SUCCESS
> [7.911s]
> [INFO] Apache CloudStack Server .......................... FAILURE
> [45.848s]
> [INFO] Apache CloudStack Framework - Quota ............... SKIPPED
> [INFO] Apache CloudStack Usage Server .................... SKIPPED
> [INFO] Apache CloudStack Cloud Engine Orchestration Component  SKIPPED
> [INFO] Apache CloudStack Cloud Services .................. SKIPPED
> [INFO] Apache CloudStack Secondary Storage ............... SKIPPED
> [INFO] Apache CloudStack Secondary Storage Service ....... SKIPPED
> [INFO] Apache CloudStack Engine Storage Component ........ SKIPPED
> [INFO] Apache CloudStack Engine Storage Image Component .. SKIPPED
> [INFO] Apache CloudStack Engine Storage Volume Component . SKIPPED
> [INFO] Apache CloudStack Engine Storage Data Motion Component  SKIPPED
> [INFO] Apache CloudStack Engine Storage Cache Component .. SKIPPED
> [INFO] Apache CloudStack Engine Storage Snapshot Component  SKIPPED
> [INFO] Apache CloudStack Cloud Engine API ................ SKIPPED
> [INFO] Apache CloudStack Cloud Engine Service ............ SKIPPED
> [INFO] Apache CloudStack Plugin POM ...................... SKIPPED
> [INFO] Apache CloudStack Plugin - API Rate Limit ......... SKIPPED
> [INFO] Apache CloudStack Plugin - Storage Volume default provider  SKIPPED
> [INFO] Apache CloudStack Plugin - Storage Volume SolidFire Provider
> SKIPPED
> [INFO] Apache CloudStack Plugin - API SolidFire Integration Testing
> SKIPPED
> [INFO] Apache CloudStack Plugin - API Discovery .......... SKIPPED
> [INFO] Apache CloudStack Plugin - ACL Static Role Based .. SKIPPED
> [INFO] Apache CloudStack Plugin - ACL Dynamic Role Based . SKIPPED
> [INFO] Apache CloudStack Plugin - Host Anti-Affinity Processor  SKIPPED
> [INFO] Apache CloudStack Plugin - Explicit Dedication Processor  SKIPPED
> [INFO] Apache CloudStack Plugin - User Concentrated Pod Deployment
> Planner  SKIPPED
> [INFO] Apache CloudStack Plugin - User Dispersing Deployment Planner
> SKIPPED
> [INFO] Apache CloudStack Plugin - Implicit Dedication Planner  SKIPPED
> [INFO] Apache CloudStack Plugin - Skip Heurestics Planner  SKIPPED
> [INFO] Apache CloudStack Plugin - Host Allocator Random .. SKIPPED
> [INFO] Apache CloudStack Plugin - Dedicated Resources .... SKIPPED
> [INFO] Apache CloudStack Plugin - Hypervisor OracleVM .... SKIPPED
> [INFO] Apache CloudStack Plugin - Open vSwitch ........... SKIPPED
> [INFO] Apache CloudStack Plugin - Hypervisor XenServer ... SKIPPED
> [INFO] Apache CloudStack Plugin - Hypervisor KVM ......... SKIPPED
> [INFO] Apache CloudStack Plugin - RabbitMQ Event Bus ..... SKIPPED
> [INFO] Apache CloudStack Plugin - In Memory Event Bus .... SKIPPED
> [INFO] Apache CloudStack Plugin - Kafka Event Bus ........ SKIPPED
> [INFO] Apache CloudStack Plugin - Hypervisor Baremetal ... SKIPPED
> [INFO] Apache CloudStack Plugin - Hypervisor UCS ......... SKIPPED
> [INFO] Apache CloudStack Plugin - Hypervisor Hyper-V ..... SKIPPED
> [INFO] Apache CloudStack Plugin - Hypervisor OracleVM3 ... SKIPPED
> [INFO] Apache CloudStack Plugin - Network Elastic Load Balancer  SKIPPED
> [INFO] Apache CloudStack Plugin - Network Internal Load Balancer  SKIPPED
> [INFO] Apache CloudStack Framework - Spring Life Cycle ... SKIPPED
> [INFO] Apache CloudStack Plugin - Network Juniper Contrail  SKIPPED
> [INFO] Apache CloudStack Plugin - Palo Alto .............. SKIPPED
> [INFO] Apache CloudStack Plugin - Network Netscaler ...... SKIPPED
> [INFO] Apache CloudStack Plugin - Network Nicira NVP ..... SKIPPED
> [INFO] Apache CloudStack Plugin - Nuage VSP .............. SKIPPED
> [INFO] Apache CloudStack Plugin - BigSwitch Virtual Network Segment
> SKIPPED
> [INFO] Apache CloudStack Plugin - Network Brocade VCS .... SKIPPED
> [INFO] Apache CloudStack Plugin - Midokura Midonet ....... SKIPPED
> [INFO] Apache CloudStack Plugin - Stratosphere SSP ....... SKIPPED
> [INFO] Apache CloudStack Plugin - Network Opendaylight ... SKIPPED
> [INFO] Apache CloudStack Plugin - Power Management Driver ipmitool  SKIPPED
> [INFO] Apache CloudStack Plugin - Storage Allocator Random  SKIPPED
> [INFO] Apache CloudStack Plugin - User Authenticator LDAP  SKIPPED
> [INFO] Apache CloudStack Plugin - User Authenticator MD5 . SKIPPED
> [INFO] Apache CloudStack Plugin - User Authenticator PBKDF2-SHA-256
> SKIPPED
> [INFO] Apache CloudStack Plugin - User Authenticator Plain Text  SKIPPED
> [INFO] Apache CloudStack Plugin - User Authenticator SAML2  SKIPPED
> [INFO] Apache CloudStack Plugin - User Authenticator SHA256 Salted  SKIPPED
> [INFO] Apache CloudStack Plugin - Dns Notifier Example ... SKIPPED
> [INFO] Apache CloudStack Plugin - Storage Image S3 provider  SKIPPED
> [INFO] Apache CloudStack Plugin - Storage Image Swift provider  SKIPPED
> [INFO] Apache CloudStack Plugin - Storage Image default provider  SKIPPED
> [INFO] Apache CloudStack Plugin - Storage Image sample provider  SKIPPED
> [INFO] Apache CloudStack Plugin - Storage Volume Nexenta Provider  SKIPPED
> [INFO] Apache CloudStack Plugin - Storage Volume CloudByte Provider
> SKIPPED
> [INFO] Apache CloudStack Plugin - Storage Volume sample provider  SKIPPED
> [INFO] Apache CloudStack Plugin - SNMP Alerts ............ SKIPPED
> [INFO] Apache CloudStack Plugin - Syslog Alerts .......... SKIPPED
> [INFO] Apache CloudStack Plugin - Network VXLAN .......... SKIPPED
> [INFO] Apache CloudStack Plugin - GloboDNS ............... SKIPPED
> [INFO] Apache CloudStack Plugin - Quota Service .......... SKIPPED
> [INFO] Apache CloudStack Framework - Spring Module ....... SKIPPED
> [INFO] Apache CloudStack Secondary Storage Controller .... SKIPPED
> [INFO] Apache CloudStack Console Proxy - RDP Client ...... SKIPPED
> [INFO] Apache CloudStack Console Proxy ................... SKIPPED
> [INFO] Apache CloudStack Console Proxy - Server .......... SKIPPED
> [INFO] Apache CloudStack System VM ....................... SKIPPED
> [INFO] Apache CloudStack Client UI ....................... SKIPPED
> [INFO] Apache CloudStack Framework - QuickCloud .......... SKIPPED
> [INFO]
> ------------------------------------------------------------------------
> [INFO] BUILD FAILURE
> [INFO]
> ------------------------------------------------------------------------
> [INFO] Total time: 6:00.764s
> [INFO] Finished at: Fri May 27 20:15:54 UTC 2016
> [INFO] Final Memory: 59M/215M
> [INFO]
> ------------------------------------------------------------------------
> [ERROR] Failed to execute goal
> org.apache.maven.plugins:maven-compiler-plugin:3.2:compile
> (default-compile) on project cloud-server: Compilation failure
> [ERROR] <
> http://jenkins.buildacloud.org/job/build-master-jdk18/ws/server/src/com/cloud/api/ApiServer.java>:[1006,34]
> error: cannot find symbol
> [ERROR] -> [Help 1]
> [ERROR]
> [ERROR] To see the full stack trace of the errors, re-run Maven with the
> -e switch.
> [ERROR] Re-run Maven using the -X switch to enable full debug logging.
> [ERROR]
> [ERROR] For more information about the errors and possible solutions,
> please read the following articles:
> [ERROR] [Help 1]
> http://cwiki.apache.org/confluence/display/MAVEN/MojoFailureException
> [ERROR]
> [ERROR] After correcting the problems, you can resume the build with the
> command
> [ERROR]   mvn <goals> -rf :cloud-server
> Build step 'Invoke top-level Maven targets' marked build as failure
> Recording test results
>

Mime
  • Unnamed multipart/alternative (inline, None, 0 bytes)
View raw message