cloudstack-dev mailing list archives

Site index · List index
Message view « Date » · « Thread »
Top « Date » · « Thread »
From jenk...@cloudstack.org
Subject Build failed in Jenkins: build-master-jdk18 #511
Date Wed, 04 May 2016 15:07:03 GMT
See <http://jenkins.buildacloud.org/job/build-master-jdk18/511/changes>

Changes:

[abhinandan.prateek] Quota: consolidated lockable account check to a method. Added unit tests

[Daan Hoogland] CLOUDSTACK-9336 surround the execution of baremetal-vr.py with condition

[slair] Cloudstack Usage Breaks if DB HA enabled

[Remi Bergsma] Set default networkDomain to empty instead of username

[dshevchenko.mail] CLOUDSTACK-8302 - Cleanup snapshot on KVM with RBD Snapshot removing

[Wido den Hollander] kvm: Aqcuire lock when running security group Python script

[milamber] Update L10N resource files with 4.7 strings from Transifex (20160502)

[Rohit Yadav] CLOUDSTACK-9348: Unit test to demonstrate denial of service attack

[Rohit Yadav] CLOUDSTACK-9348: Use non-blocking SSL handshake

------------------------------------------
[...truncated 816 lines...]
2016-05-04 15:16:17,072 DEBUG [utils.testcase.NioTest] (Time-limited test:) 0/5 tests done.
Waiting for completion
2016-05-04 15:16:18,076 DEBUG [utils.testcase.NioTest] (Time-limited test:) 0/5 tests done.
Waiting for completion
2016-05-04 15:16:19,078 DEBUG [utils.testcase.NioTest] (Time-limited test:) 0/5 tests done.
Waiting for completion
2016-05-04 15:16:20,080 DEBUG [utils.testcase.NioTest] (Time-limited test:) 0/5 tests done.
Waiting for completion
2016-05-04 15:16:21,086 DEBUG [utils.testcase.NioTest] (Time-limited test:) 0/5 tests done.
Waiting for completion
2016-05-04 15:16:22,088 DEBUG [utils.testcase.NioTest] (Time-limited test:) 0/5 tests done.
Waiting for completion
2016-05-04 15:16:23,091 DEBUG [utils.testcase.NioTest] (Time-limited test:) 0/5 tests done.
Waiting for completion
2016-05-04 15:16:24,093 DEBUG [utils.testcase.NioTest] (Time-limited test:) 0/5 tests done.
Waiting for completion
2016-05-04 15:16:25,096 DEBUG [utils.testcase.NioTest] (Time-limited test:) 0/5 tests done.
Waiting for completion
2016-05-04 15:16:26,097 DEBUG [utils.testcase.NioTest] (Time-limited test:) 0/5 tests done.
Waiting for completion
2016-05-04 15:16:27,098 DEBUG [utils.testcase.NioTest] (Time-limited test:) 0/5 tests done.
Waiting for completion
2016-05-04 15:16:28,099 DEBUG [utils.testcase.NioTest] (Time-limited test:) 0/5 tests done.
Waiting for completion
2016-05-04 15:16:29,100 DEBUG [utils.testcase.NioTest] (Time-limited test:) 0/5 tests done.
Waiting for completion
2016-05-04 15:16:30,101 DEBUG [utils.testcase.NioTest] (Time-limited test:) 0/5 tests done.
Waiting for completion
2016-05-04 15:16:31,102 DEBUG [utils.testcase.NioTest] (Time-limited test:) 0/5 tests done.
Waiting for completion
2016-05-04 15:16:32,105 DEBUG [utils.testcase.NioTest] (Time-limited test:) 0/5 tests done.
Waiting for completion
2016-05-04 15:16:33,109 DEBUG [utils.testcase.NioTest] (Time-limited test:) 0/5 tests done.
Waiting for completion
2016-05-04 15:16:34,110 DEBUG [utils.testcase.NioTest] (Time-limited test:) 0/5 tests done.
Waiting for completion
2016-05-04 15:16:35,111 DEBUG [utils.testcase.NioTest] (Time-limited test:) 0/5 tests done.
Waiting for completion
2016-05-04 15:16:36,112 DEBUG [utils.testcase.NioTest] (Time-limited test:) 0/5 tests done.
Waiting for completion
2016-05-04 15:16:37,113 DEBUG [utils.testcase.NioTest] (Time-limited test:) 0/5 tests done.
Waiting for completion
2016-05-04 15:16:38,115 DEBUG [utils.testcase.NioTest] (Time-limited test:) 0/5 tests done.
Waiting for completion
2016-05-04 15:16:39,116 DEBUG [utils.testcase.NioTest] (Time-limited test:) 0/5 tests done.
Waiting for completion
2016-05-04 15:16:40,118 DEBUG [utils.testcase.NioTest] (Time-limited test:) 0/5 tests done.
Waiting for completion
2016-05-04 15:16:41,119 DEBUG [utils.testcase.NioTest] (Time-limited test:) 0/5 tests done.
Waiting for completion
2016-05-04 15:16:42,128 DEBUG [utils.testcase.NioTest] (Time-limited test:) 0/5 tests done.
Waiting for completion
2016-05-04 15:16:43,130 DEBUG [utils.testcase.NioTest] (Time-limited test:) 0/5 tests done.
Waiting for completion
2016-05-04 15:16:44,135 DEBUG [utils.testcase.NioTest] (Time-limited test:) 0/5 tests done.
Waiting for completion
2016-05-04 15:16:44,402 INFO  [utils.testcase.NioTest] (main:) Clients stopped.
2016-05-04 15:16:44,402 INFO  [utils.testcase.NioTest] (main:) Server stopped.
Tests run: 1, Failures: 0, Errors: 1, Skipped: 0, Time elapsed: 300.157 sec <<< FAILURE!
- in com.cloud.utils.testcase.NioTest
testConnection(com.cloud.utils.testcase.NioTest)  Time elapsed: 300.153 sec  <<<
ERROR!
org.junit.runners.model.TestTimedOutException: test timed out after 300000 milliseconds
	at java.lang.Thread.sleep(Native Method)
	at com.cloud.utils.testcase.NioTest.testConnection(NioTest.java:146)

Running com.cloud.utils.ProcessUtilTest
2016-05-04 15:16:44,466 DEBUG [cloud.utils.ProcessUtil] (main:) environment.properties could
not be opened
2016-05-04 15:16:44,472 DEBUG [cloud.utils.ProcessUtil] (main:) environment.properties could
not be opened
2016-05-04 15:16:44,472 DEBUG [cloud.utils.ProcessUtil] (main:) Executing: bash -c ps -p 123456

2016-05-04 15:16:44,688 DEBUG [cloud.utils.ProcessUtil] (main:) Exit value is 1
2016-05-04 15:16:44,699 DEBUG [cloud.utils.ProcessUtil] (main:)   PID TTY          TIME CMD
2016-05-04 15:16:44,710 DEBUG [cloud.utils.ProcessUtil] (main:) Executing: bash -c echo $PPID

2016-05-04 15:16:44,739 DEBUG [cloud.utils.ProcessUtil] (main:) Execution is successful.
2016-05-04 15:16:44,751 DEBUG [cloud.utils.ProcessUtil] (main:) environment.properties could
not be opened
Tests run: 3, Failures: 0, Errors: 0, Skipped: 0, Time elapsed: 0.041 sec - in com.cloud.utils.ProcessUtilTest
Running com.cloud.utils.PasswordGeneratorTest
Tests run: 1, Failures: 0, Errors: 0, Skipped: 0, Time elapsed: 0 sec - in com.cloud.utils.PasswordGeneratorTest
Running com.cloud.utils.rest.HttpUriRequestBuilderTest
Tests run: 7, Failures: 0, Errors: 0, Skipped: 0, Time elapsed: 0.058 sec - in com.cloud.utils.rest.HttpUriRequestBuilderTest
Running com.cloud.utils.rest.HttpStatusCodeHelperTest
Tests run: 2, Failures: 0, Errors: 0, Skipped: 0, Time elapsed: 0 sec - in com.cloud.utils.rest.HttpStatusCodeHelperTest
Running com.cloud.utils.rest.RESTServiceConnectorTest
2016-05-04 15:16:45,231 DEBUG [utils.rest.RESTServiceConnector] (main:) Executing retrieve
object on /somepath
2016-05-04 15:16:45,232 DEBUG [utils.rest.BasicRestClient] (main:) Executig GET request on
https://localhost:443/somepath
2016-05-04 15:16:45,254 DEBUG [utils.rest.RESTServiceConnector] (main:) Executed request:
GET /somepath HTTP/1.1 status was HTTP/1.1 200 OK
2016-05-04 15:16:45,300 DEBUG [utils.rest.BasicRestClient] (main:) Closing HTTP connection
2016-05-04 15:16:45,313 DEBUG [utils.rest.RESTServiceConnector] (main:) Executing create object
on /somepath
2016-05-04 15:16:45,318 DEBUG [utils.rest.RESTServiceConnector] (main:) Built request 'POST
/somepath HTTP/1.1' with payload: Optional.of({"field":"newValue"})
2016-05-04 15:16:45,318 DEBUG [utils.rest.BasicRestClient] (main:) Executig POST request on
https://localhost:443/somepath
2016-05-04 15:16:45,319 DEBUG [utils.rest.RESTServiceConnector] (main:) Executed request:
POST /somepath HTTP/1.1 status was HTTP/1.1 200 OK
2016-05-04 15:16:45,321 DEBUG [utils.rest.BasicRestClient] (main:) Closing HTTP connection
2016-05-04 15:16:45,337 DEBUG [utils.rest.RESTServiceConnector] (main:) Executing create object
on /somepath
2016-05-04 15:16:45,338 DEBUG [utils.rest.RESTServiceConnector] (main:) Built request 'POST
/somepath?arg2=val2&arg1=val1 HTTP/1.1' with payload: Optional.of({"field":"newValue"})
2016-05-04 15:16:45,338 DEBUG [utils.rest.BasicRestClient] (main:) Executig POST request on
https://localhost:443/somepath?arg2=val2&arg1=val1
2016-05-04 15:16:45,338 DEBUG [utils.rest.RESTServiceConnector] (main:) Executed request:
POST /somepath?arg2=val2&arg1=val1 HTTP/1.1 status was HTTP/1.1 200 OK
2016-05-04 15:16:45,339 DEBUG [utils.rest.BasicRestClient] (main:) Closing HTTP connection
2016-05-04 15:16:45,350 DEBUG [utils.rest.RESTServiceConnector] (main:) Executing update object
on /somepath
2016-05-04 15:16:45,351 DEBUG [utils.rest.RESTServiceConnector] (main:) Built request 'PUT
/somepath?arg2=val2&arg1=val1 HTTP/1.1' with payload: Optional.of({"field":"newValue"})
2016-05-04 15:16:45,351 DEBUG [utils.rest.BasicRestClient] (main:) Executig PUT request on
https://localhost:443/somepath?arg2=val2&arg1=val1
2016-05-04 15:16:45,351 DEBUG [utils.rest.RESTServiceConnector] (main:) Executed request:
PUT /somepath?arg2=val2&arg1=val1 HTTP/1.1 status was HTTP/1.1 200 OK
2016-05-04 15:16:45,351 DEBUG [utils.rest.BasicRestClient] (main:) Closing HTTP connection
2016-05-04 15:16:45,676 DEBUG [utils.rest.RESTServiceConnector] (main:) Executing retrieve
object on /somepath
2016-05-04 15:16:45,678 DEBUG [utils.rest.BasicRestClient] (main:) Executig GET request on
https://localhost:443/somepath
2016-05-04 15:16:45,679 DEBUG [utils.rest.RESTServiceConnector] (main:) Executed request:
GET /somepath HTTP/1.1 status was HTTP/1.1 200 OK
2016-05-04 15:16:45,683 DEBUG [utils.rest.BasicRestClient] (main:) Closing HTTP connection
2016-05-04 15:16:45,685 DEBUG [utils.rest.RESTServiceConnector] (main:) Executing update object
on /somepath
2016-05-04 15:16:45,685 DEBUG [utils.rest.RESTServiceConnector] (main:) Built request 'PUT
/somepath HTTP/1.1' with payload: Optional.of({"field":"newValue"})
2016-05-04 15:16:45,685 DEBUG [utils.rest.BasicRestClient] (main:) Executig PUT request on
https://localhost:443/somepath
2016-05-04 15:16:45,686 DEBUG [utils.rest.RESTServiceConnector] (main:) Executed request:
PUT /somepath HTTP/1.1 status was HTTP/1.1 200 OK
2016-05-04 15:16:45,686 DEBUG [utils.rest.BasicRestClient] (main:) Closing HTTP connection
2016-05-04 15:16:45,708 DEBUG [utils.rest.RESTServiceConnector] (main:) Executing delete object
on /somepath
2016-05-04 15:16:45,708 DEBUG [utils.rest.BasicRestClient] (main:) Executig DELETE request
on https://localhost:443/somepath
2016-05-04 15:16:45,709 DEBUG [utils.rest.RESTServiceConnector] (main:) Executed request:
DELETE /somepath HTTP/1.1 status was HTTP/1.1 200 OK
2016-05-04 15:16:45,709 DEBUG [utils.rest.BasicRestClient] (main:) Closing HTTP connection
2016-05-04 15:16:45,724 DEBUG [utils.rest.RESTServiceConnector] (main:) Executing retrieve
object on /somepath
2016-05-04 15:16:45,725 DEBUG [utils.rest.BasicRestClient] (main:) Executig GET request on
https://localhost:443/somepath?arg2=val2&arg1=val1
2016-05-04 15:16:45,725 DEBUG [utils.rest.RESTServiceConnector] (main:) Executed request:
GET /somepath?arg2=val2&arg1=val1 HTTP/1.1 status was HTTP/1.1 200 OK
2016-05-04 15:16:45,725 DEBUG [utils.rest.BasicRestClient] (main:) Closing HTTP connection
2016-05-04 15:16:45,728 DEBUG [utils.rest.RESTServiceConnector] (main:) Executing retrieve
object on /somepath
2016-05-04 15:16:45,728 DEBUG [utils.rest.BasicRestClient] (main:) Executig GET request on
https://localhost:443/somepath
2016-05-04 15:16:45,728 DEBUG [utils.rest.RESTServiceConnector] (main:) Executed request:
GET /somepath HTTP/1.1 status was HTTP/1.1 200 OK
2016-05-04 15:16:45,729 DEBUG [utils.rest.BasicRestClient] (main:) Closing HTTP connection
Tests run: 9, Failures: 0, Errors: 0, Skipped: 0, Time elapsed: 0.924 sec - in com.cloud.utils.rest.RESTServiceConnectorTest
Running com.cloud.utils.rest.BasicRestClientTest
2016-05-04 15:16:46,465 DEBUG [utils.rest.BasicRestClient] (main:) Executig GET request on
https://fakelocalhost.fakelocaldomain:443/path
2016-05-04 15:16:46,486 DEBUG [utils.rest.BasicRestClient] (main:) Executig GET request on
https://fakelocalhost.fakelocaldomain:443/path
2016-05-04 15:16:46,688 DEBUG [utils.rest.BasicRestClient] (main:) Executig GET request on
https://fakelocalhost.fakelocaldomain:443/path
Tests run: 3, Failures: 0, Errors: 0, Skipped: 0, Time elapsed: 0.94 sec - in com.cloud.utils.rest.BasicRestClientTest
Running com.cloud.utils.rest.HttpClientHelperTest
Tests run: 1, Failures: 0, Errors: 0, Skipped: 0, Time elapsed: 0.032 sec - in com.cloud.utils.rest.HttpClientHelperTest
Running com.cloud.utils.StringUtilsTest
Tests run: 27, Failures: 0, Errors: 0, Skipped: 0, Time elapsed: 0.083 sec - in com.cloud.utils.StringUtilsTest
Running com.cloud.utils.ReflectUtilTest
Tests run: 7, Failures: 0, Errors: 0, Skipped: 0, Time elapsed: 0.03 sec - in com.cloud.utils.ReflectUtilTest
Running org.apache.cloudstack.utils.hypervisor.HypervisorUtilsTest
Testing don't block on newly created clones - pass
Testing block on modified files - pass
Testing timeout of blocking on modified files - pass
Tests run: 3, Failures: 0, Errors: 0, Skipped: 0, Time elapsed: 5.212 sec - in org.apache.cloudstack.utils.hypervisor.HypervisorUtilsTest
Running org.apache.cloudstack.utils.imagestore.ImageStoreUtilTest
Tests run: 1, Failures: 0, Errors: 0, Skipped: 0, Time elapsed: 0.013 sec - in org.apache.cloudstack.utils.imagestore.ImageStoreUtilTest
Running org.apache.cloudstack.utils.volume.VirtualMachineDiskInfoTest
Tests run: 3, Failures: 0, Errors: 0, Skipped: 0, Time elapsed: 0.01 sec - in org.apache.cloudstack.utils.volume.VirtualMachineDiskInfoTest

Results :

Tests in error: 
  NioTest.testConnection:146 ยป TestTimedOut test timed out after 300000 millisec...

Tests run: 200, Failures: 0, Errors: 1, Skipped: 1

[INFO] ------------------------------------------------------------------------
[INFO] Reactor Summary:
[INFO] 
[INFO] Apache CloudStack Developer Tools - Checkstyle Configuration  SUCCESS [3.073s]
[INFO] Apache CloudStack ................................. SUCCESS [2.301s]
[INFO] Apache CloudStack Maven Conventions Parent ........ SUCCESS [6.629s]
[INFO] Apache CloudStack Framework - Managed Context ..... SUCCESS [8.551s]
[INFO] Apache CloudStack Utils ........................... FAILURE [5:52.973s]
[INFO] Apache CloudStack Framework ....................... SKIPPED
[INFO] Apache CloudStack Framework - Event Notification .. SKIPPED
[INFO] Apache CloudStack Framework - Configuration ....... SKIPPED
[INFO] Apache CloudStack API ............................. SKIPPED
[INFO] Apache CloudStack Framework - REST ................ SKIPPED
[INFO] Apache CloudStack Framework - IPC ................. SKIPPED
[INFO] Apache CloudStack Cloud Engine .................... SKIPPED
[INFO] Apache CloudStack Cloud Engine API ................ SKIPPED
[INFO] Apache CloudStack Framework - Security ............ SKIPPED
[INFO] Apache CloudStack Core ............................ SKIPPED
[INFO] Apache CloudStack Agents .......................... SKIPPED
[INFO] Apache CloudStack Framework - Clustering .......... SKIPPED
[INFO] Apache CloudStack Framework - Event Notification .. SKIPPED
[INFO] Apache CloudStack Cloud Engine Schema Component ... SKIPPED
[INFO] Apache CloudStack Framework - Jobs ................ SKIPPED
[INFO] Apache CloudStack Cloud Engine Internal Components API  SKIPPED
[INFO] Apache CloudStack Server .......................... SKIPPED
[INFO] Apache CloudStack Framework - Quota ............... SKIPPED
[INFO] Apache CloudStack Usage Server .................... SKIPPED
[INFO] Apache CloudStack Cloud Engine Orchestration Component  SKIPPED
[INFO] Apache CloudStack Cloud Services .................. SKIPPED
[INFO] Apache CloudStack Secondary Storage ............... SKIPPED
[INFO] Apache CloudStack Secondary Storage Service ....... SKIPPED
[INFO] Apache CloudStack Engine Storage Component ........ SKIPPED
[INFO] Apache CloudStack Engine Storage Volume Component . SKIPPED
[INFO] Apache CloudStack Engine Storage Image Component .. SKIPPED
[INFO] Apache CloudStack Engine Storage Data Motion Component  SKIPPED
[INFO] Apache CloudStack Engine Storage Cache Component .. SKIPPED
[INFO] Apache CloudStack Engine Storage Snapshot Component  SKIPPED
[INFO] Apache CloudStack Cloud Engine API ................ SKIPPED
[INFO] Apache CloudStack Cloud Engine Service ............ SKIPPED
[INFO] Apache CloudStack Plugin POM ...................... SKIPPED
[INFO] Apache CloudStack Plugin - API Rate Limit ......... SKIPPED
[INFO] Apache CloudStack Plugin - Storage Volume default provider  SKIPPED
[INFO] Apache CloudStack Plugin - Storage Volume SolidFire Provider  SKIPPED
[INFO] Apache CloudStack Plugin - API SolidFire .......... SKIPPED
[INFO] Apache CloudStack Plugin - API Discovery .......... SKIPPED
[INFO] Apache CloudStack Plugin - ACL Static Role Based .. SKIPPED
[INFO] Apache CloudStack Plugin - Host Anti-Affinity Processor  SKIPPED
[INFO] Apache CloudStack Plugin - Explicit Dedication Processor  SKIPPED
[INFO] Apache CloudStack Plugin - User Concentrated Pod Deployment Planner  SKIPPED
[INFO] Apache CloudStack Plugin - User Dispersing Deployment Planner  SKIPPED
[INFO] Apache CloudStack Plugin - Implicit Dedication Planner  SKIPPED
[INFO] Apache CloudStack Plugin - Skip Heurestics Planner  SKIPPED
[INFO] Apache CloudStack Plugin - Host Allocator Random .. SKIPPED
[INFO] Apache CloudStack Plugin - Dedicated Resources .... SKIPPED
[INFO] Apache CloudStack Plugin - Hypervisor OracleVM .... SKIPPED
[INFO] Apache CloudStack Plugin - Open vSwitch ........... SKIPPED
[INFO] Apache CloudStack Plugin - Hypervisor XenServer ... SKIPPED
[INFO] Apache CloudStack Plugin - Hypervisor KVM ......... SKIPPED
[INFO] Apache CloudStack Plugin - RabbitMQ Event Bus ..... SKIPPED
[INFO] Apache CloudStack Plugin - In Memory Event Bus .... SKIPPED
[INFO] Apache CloudStack Plugin - Kafka Event Bus ........ SKIPPED
[INFO] Apache CloudStack Plugin - Hypervisor Baremetal ... SKIPPED
[INFO] Apache CloudStack Plugin - Hypervisor UCS ......... SKIPPED
[INFO] Apache CloudStack Plugin - Hypervisor Hyper-V ..... SKIPPED
[INFO] Apache CloudStack Plugin - Hypervisor OracleVM3 ... SKIPPED
[INFO] Apache CloudStack Plugin - Network Elastic Load Balancer  SKIPPED
[INFO] Apache CloudStack Plugin - Network Internal Load Balancer  SKIPPED
[INFO] Apache CloudStack Framework - Spring Life Cycle ... SKIPPED
[INFO] Apache CloudStack Plugin - Network Juniper Contrail  SKIPPED
[INFO] Apache CloudStack Plugin - Palo Alto .............. SKIPPED
[INFO] Apache CloudStack Plugin - Network Netscaler ...... SKIPPED
[INFO] Apache CloudStack Plugin - Network Nicira NVP ..... SKIPPED
[INFO] Apache CloudStack Plugin - BigSwitch Virtual Network Segment  SKIPPED
[INFO] Apache CloudStack Plugin - Network Brocade VCS .... SKIPPED
[INFO] Apache CloudStack Plugin - Midokura Midonet ....... SKIPPED
[INFO] Apache CloudStack Plugin - Stratosphere SSP ....... SKIPPED
[INFO] Apache CloudStack Plugin - Network Opendaylight ... SKIPPED
[INFO] Apache CloudStack Plugin - Storage Allocator Random  SKIPPED
[INFO] Apache CloudStack Plugin - User Authenticator LDAP  SKIPPED
[INFO] Apache CloudStack Plugin - User Authenticator MD5 . SKIPPED
[INFO] Apache CloudStack Plugin - User Authenticator PBKDF2-SHA-256  SKIPPED
[INFO] Apache CloudStack Plugin - User Authenticator Plain Text  SKIPPED
[INFO] Apache CloudStack Plugin - User Authenticator SAML2  SKIPPED
[INFO] Apache CloudStack Plugin - User Authenticator SHA256 Salted  SKIPPED
[INFO] Apache CloudStack Plugin - Dns Notifier Example ... SKIPPED
[INFO] Apache CloudStack Plugin - Storage Image S3 provider  SKIPPED
[INFO] Apache CloudStack Plugin - Storage Image Swift provider  SKIPPED
[INFO] Apache CloudStack Plugin - Storage Image default provider  SKIPPED
[INFO] Apache CloudStack Plugin - Storage Image sample provider  SKIPPED
[INFO] Apache CloudStack Plugin - Storage Volume Nexenta Provider  SKIPPED
[INFO] Apache CloudStack Plugin - Storage Volume CloudByte Provider  SKIPPED
[INFO] Apache CloudStack Plugin - Storage Volume sample provider  SKIPPED
[INFO] Apache CloudStack Plugin - SNMP Alerts ............ SKIPPED
[INFO] Apache CloudStack Plugin - Syslog Alerts .......... SKIPPED
[INFO] Apache CloudStack Plugin - Network VXLAN .......... SKIPPED
[INFO] Apache CloudStack Plugin - GloboDNS ............... SKIPPED
[INFO] Apache CloudStack Plugin - Quota Service .......... SKIPPED
[INFO] Apache CloudStack Framework - Spring Module ....... SKIPPED
[INFO] Apache CloudStack Secondary Storage Controller .... SKIPPED
[INFO] Apache CloudStack Console Proxy - RDP Client ...... SKIPPED
[INFO] Apache CloudStack Console Proxy ................... SKIPPED
[INFO] Apache CloudStack Console Proxy - Server .......... SKIPPED
[INFO] Apache CloudStack System VM ....................... SKIPPED
[INFO] Apache CloudStack Client UI ....................... SKIPPED
[INFO] Apache CloudStack Framework - QuickCloud .......... SKIPPED
[INFO] ------------------------------------------------------------------------
[INFO] BUILD FAILURE
[INFO] ------------------------------------------------------------------------
[INFO] Total time: 6:20.527s
[INFO] Finished at: Wed May 04 15:16:52 UTC 2016
[INFO] Final Memory: 47M/170M
[INFO] ------------------------------------------------------------------------
[ERROR] Failed to execute goal org.apache.maven.plugins:maven-surefire-plugin:2.18.1:test
(default-test) on project cloud-utils: There are test failures.
[ERROR] 
[ERROR] Please refer to <http://jenkins.buildacloud.org/job/build-master-jdk18/ws/utils/target/surefire-reports>
for the individual test results.
[ERROR] -> [Help 1]
[ERROR] 
[ERROR] To see the full stack trace of the errors, re-run Maven with the -e switch.
[ERROR] Re-run Maven using the -X switch to enable full debug logging.
[ERROR] 
[ERROR] For more information about the errors and possible solutions, please read the following
articles:
[ERROR] [Help 1] http://cwiki.apache.org/confluence/display/MAVEN/MojoFailureException
[ERROR] 
[ERROR] After correcting the problems, you can resume the build with the command
[ERROR]   mvn <goals> -rf :cloud-utils
Build step 'Invoke top-level Maven targets' marked build as failure
Recording test results

Mime
View raw message