cloudstack-dev mailing list archives

Site index · List index
Message view « Date » · « Thread »
Top « Date » · « Thread »
From jenk...@cloudstack.org
Subject Build failed in Jenkins: build-master-slowbuild #3569
Date Sat, 21 May 2016 07:37:05 GMT
See <http://jenkins.buildacloud.org/job/build-master-slowbuild/3569/>

------------------------------------------
[...truncated 6095 lines...]
	at org.apache.commons.pool.impl.GenericObjectPool.borrowObject(GenericObjectPool.java:1188)
	at org.apache.commons.dbcp.PoolingDataSource.getConnection(PoolingDataSource.java:106)
	at com.cloud.utils.db.TransactionLegacy.getConnection(TransactionLegacy.java:546)
	at com.cloud.utils.db.TransactionLegacy.prepareStatement(TransactionLegacy.java:457)
	at com.cloud.utils.db.TransactionLegacy.prepareAutoCloseStatement(TransactionLegacy.java:450)
	at com.cloud.server.ConfigurationServerImpl.updateSystemvmPassword(ConfigurationServerImpl.java:676)
	at com.cloud.server.ConfigurationServerImplTest.testUpdateSystemvmPassword(ConfigurationServerImplTest.java:158)
	at sun.reflect.NativeMethodAccessorImpl.invoke0(Native Method)
	at sun.reflect.NativeMethodAccessorImpl.invoke(NativeMethodAccessorImpl.java:57)
	at sun.reflect.DelegatingMethodAccessorImpl.invoke(DelegatingMethodAccessorImpl.java:43)
	at java.lang.reflect.Method.invoke(Method.java:606)
	at org.junit.runners.model.FrameworkMethod$1.runReflectiveCall(FrameworkMethod.java:50)
	at org.junit.internal.runners.model.ReflectiveCallable.run(ReflectiveCallable.java:12)
	at org.junit.runners.model.FrameworkMethod.invokeExplosively(FrameworkMethod.java:47)
	at org.junit.internal.runners.statements.InvokeMethod.evaluate(InvokeMethod.java:17)
	at org.junit.runners.ParentRunner.runLeaf(ParentRunner.java:325)
	at org.junit.runners.BlockJUnit4ClassRunner.runChild(BlockJUnit4ClassRunner.java:78)
	at org.junit.runners.BlockJUnit4ClassRunner.runChild(BlockJUnit4ClassRunner.java:57)
	at org.junit.runners.ParentRunner$3.run(ParentRunner.java:290)
	at org.junit.runners.ParentRunner$1.schedule(ParentRunner.java:71)
	at org.junit.runners.ParentRunner.runChildren(ParentRunner.java:288)
	at org.junit.runners.ParentRunner.access$000(ParentRunner.java:58)
	at org.junit.runners.ParentRunner$2.evaluate(ParentRunner.java:268)
	at org.junit.runners.ParentRunner.run(ParentRunner.java:363)
	at org.mockito.internal.runners.JUnit45AndHigherRunnerImpl.run(JUnit45AndHigherRunnerImpl.java:37)
	at org.mockito.runners.MockitoJUnitRunner.run(MockitoJUnitRunner.java:62)
	at org.apache.maven.surefire.junit4.JUnit4Provider.execute(JUnit4Provider.java:283)
	at org.apache.maven.surefire.junit4.JUnit4Provider.executeWithRerun(JUnit4Provider.java:173)
	at org.apache.maven.surefire.junit4.JUnit4Provider.executeTestSet(JUnit4Provider.java:153)
	at org.apache.maven.surefire.junit4.JUnit4Provider.invoke(JUnit4Provider.java:128)
	at org.apache.maven.surefire.booter.ForkedBooter.invokeProviderInSameClassLoader(ForkedBooter.java:203)
	at org.apache.maven.surefire.booter.ForkedBooter.runSuitesInProcess(ForkedBooter.java:155)
	at org.apache.maven.surefire.booter.ForkedBooter.main(ForkedBooter.java:103)
Tests run: 5, Failures: 0, Errors: 0, Skipped: 0, Time elapsed: 0.071 sec - in com.cloud.server.ConfigurationServerImplTest
Running com.cloud.template.TemplateManagerImplTest
ERROR  prepareTemplateForCreate, Unable to find a secondary storage host who has completely
downloaded the template.
WARN   prepareTemplate, Skip loading template 202 into primary storage 2 as either the pool
zone 1 is different from the requested zone 1 or the pool is currently not available.
Tests run: 8, Failures: 0, Errors: 0, Skipped: 0, Time elapsed: 3.37 sec - in com.cloud.template.TemplateManagerImplTest
Running com.cloud.keystore.KeystoreTest
org.apache.cloudstack.api.response.UserVmResponse/null/{"id":"3","securitygroup":[],"nic":[],"affinitygroup":[],"tags":[]}
org.apache.cloudstack.api.response.AlertResponse/null/{"id":"100","description":"Hello"}
Tests run: 1, Failures: 0, Errors: 0, Skipped: 0, Time elapsed: 0.034 sec - in com.cloud.keystore.KeystoreTest
Running com.cloud.storage.VolumeApiServiceImplTest
Tests run: 19, Failures: 0, Errors: 0, Skipped: 0, Time elapsed: 0.214 sec - in com.cloud.storage.VolumeApiServiceImplTest
Running com.cloud.storage.ImageStoreDetailsUtilTest
Tests run: 5, Failures: 0, Errors: 0, Skipped: 0, Time elapsed: 0.017 sec - in com.cloud.storage.ImageStoreDetailsUtilTest
Running com.cloud.storage.snapshot.SnapshotManagerTest
Tests run: 8, Failures: 0, Errors: 0, Skipped: 0, Time elapsed: 0.104 sec - in com.cloud.storage.snapshot.SnapshotManagerTest
Running com.cloud.api.query.dao.SecurityGroupJoinDaoImplTest
Tests run: 6, Failures: 0, Errors: 0, Skipped: 0, Time elapsed: 0.124 sec - in com.cloud.api.query.dao.SecurityGroupJoinDaoImplTest
Running com.cloud.api.query.dao.VolumeJoinDaoImplTest
Tests run: 1, Failures: 0, Errors: 0, Skipped: 0, Time elapsed: 1.672 sec - in com.cloud.api.query.dao.VolumeJoinDaoImplTest
Running com.cloud.api.query.dao.TemplateJoinDaoImplTest
Tests run: 1, Failures: 0, Errors: 0, Skipped: 0, Time elapsed: 1.851 sec - in com.cloud.api.query.dao.TemplateJoinDaoImplTest
Running com.cloud.api.query.dao.UserVmJoinDaoImplTest
Tests run: 1, Failures: 0, Errors: 0, Skipped: 0, Time elapsed: 4.552 sec - in com.cloud.api.query.dao.UserVmJoinDaoImplTest

Results :

Tests run: 210, Failures: 0, Errors: 0, Skipped: 3

[INFO] ------------------------------------------------------------------------
[INFO] Reactor Summary:
[INFO] 
[INFO] Apache CloudStack Developer Tools - Checkstyle Configuration  SUCCESS [2.199s]
[INFO] Apache CloudStack ................................. SUCCESS [2.534s]
[INFO] Apache CloudStack Maven Conventions Parent ........ SUCCESS [1.309s]
[INFO] Apache CloudStack Framework - Managed Context ..... SUCCESS [22.016s]
[INFO] Apache CloudStack Utils ........................... SUCCESS [1:37.298s]
[INFO] Apache CloudStack Framework ....................... SUCCESS [0.149s]
[INFO] Apache CloudStack Framework - Event Notification .. SUCCESS [57.098s]
[INFO] Apache CloudStack Framework - Configuration ....... SUCCESS [28.493s]
[INFO] Apache CloudStack API ............................. SUCCESS [2:05.677s]
[INFO] Apache CloudStack Framework - REST ................ SUCCESS [17.746s]
[INFO] Apache CloudStack Framework - IPC ................. SUCCESS [32.063s]
[INFO] Apache CloudStack Cloud Engine .................... SUCCESS [0.099s]
[INFO] Apache CloudStack Cloud Engine API ................ SUCCESS [30.112s]
[INFO] Apache CloudStack Framework - Security ............ SUCCESS [27.449s]
[INFO] Apache CloudStack Core ............................ SUCCESS [1:27.614s]
[INFO] Apache CloudStack Agents .......................... SUCCESS [38.140s]
[INFO] Apache CloudStack Framework - Clustering .......... SUCCESS [38.575s]
[INFO] Apache CloudStack Framework - Event Notification .. SUCCESS [15.991s]
[INFO] Apache CloudStack Cloud Engine Schema Component ... SUCCESS [2:18.699s]
[INFO] Apache CloudStack Framework - Jobs ................ SUCCESS [44.271s]
[INFO] Apache CloudStack Cloud Engine Internal Components API  SUCCESS [26.691s]
[INFO] Apache CloudStack Server .......................... FAILURE [4:21.959s]
[INFO] Apache CloudStack Framework - Quota ............... SKIPPED
[INFO] Apache CloudStack Usage Server .................... SKIPPED
[INFO] Apache CloudStack Cloud Engine Orchestration Component  SKIPPED
[INFO] Apache CloudStack Cloud Services .................. SKIPPED
[INFO] Apache CloudStack Secondary Storage ............... SKIPPED
[INFO] Apache CloudStack Secondary Storage Service ....... SKIPPED
[INFO] Apache CloudStack Engine Storage Component ........ SKIPPED
[INFO] Apache CloudStack Engine Storage Volume Component . SKIPPED
[INFO] Apache CloudStack Engine Storage Image Component .. SKIPPED
[INFO] Apache CloudStack Engine Storage Data Motion Component  SKIPPED
[INFO] Apache CloudStack Engine Storage Cache Component .. SKIPPED
[INFO] Apache CloudStack Engine Storage Snapshot Component  SKIPPED
[INFO] Apache CloudStack Cloud Engine API ................ SKIPPED
[INFO] Apache CloudStack Cloud Engine Service ............ SKIPPED
[INFO] Apache CloudStack Plugin POM ...................... SKIPPED
[INFO] Apache CloudStack Plugin - API Rate Limit ......... SKIPPED
[INFO] Apache CloudStack Plugin - Storage Volume default provider  SKIPPED
[INFO] Apache CloudStack Plugin - Storage Volume SolidFire Provider  SKIPPED
[INFO] Apache CloudStack Plugin - API SolidFire .......... SKIPPED
[INFO] Apache CloudStack Plugin - API Discovery .......... SKIPPED
[INFO] Apache CloudStack Plugin - ACL Static Role Based .. SKIPPED
[INFO] Apache CloudStack Plugin - ACL Dynamic Role Based . SKIPPED
[INFO] Apache CloudStack Plugin - Host Anti-Affinity Processor  SKIPPED
[INFO] Apache CloudStack Plugin - Explicit Dedication Processor  SKIPPED
[INFO] Apache CloudStack Plugin - User Concentrated Pod Deployment Planner  SKIPPED
[INFO] Apache CloudStack Plugin - User Dispersing Deployment Planner  SKIPPED
[INFO] Apache CloudStack Plugin - Implicit Dedication Planner  SKIPPED
[INFO] Apache CloudStack Plugin - Skip Heurestics Planner  SKIPPED
[INFO] Apache CloudStack Plugin - Host Allocator Random .. SKIPPED
[INFO] Apache CloudStack Plugin - Dedicated Resources .... SKIPPED
[INFO] Apache CloudStack Plugin - Hypervisor OracleVM .... SKIPPED
[INFO] Apache CloudStack Plugin - Open vSwitch ........... SKIPPED
[INFO] Apache CloudStack Plugin - Hypervisor XenServer ... SKIPPED
[INFO] Apache CloudStack Plugin - Hypervisor KVM ......... SKIPPED
[INFO] Apache CloudStack Plugin - RabbitMQ Event Bus ..... SKIPPED
[INFO] Apache CloudStack Plugin - In Memory Event Bus .... SKIPPED
[INFO] Apache CloudStack Plugin - Kafka Event Bus ........ SKIPPED
[INFO] Apache CloudStack Plugin - Hypervisor Baremetal ... SKIPPED
[INFO] Apache CloudStack Plugin - Hypervisor UCS ......... SKIPPED
[INFO] Apache CloudStack Plugin - Hypervisor Hyper-V ..... SKIPPED
[INFO] Apache CloudStack Plugin - Hypervisor OracleVM3 ... SKIPPED
[INFO] Apache CloudStack Plugin - Network Elastic Load Balancer  SKIPPED
[INFO] Apache CloudStack Plugin - Network Internal Load Balancer  SKIPPED
[INFO] Apache CloudStack Framework - Spring Life Cycle ... SKIPPED
[INFO] Apache CloudStack Plugin - Network Juniper Contrail  SKIPPED
[INFO] Apache CloudStack Plugin - Palo Alto .............. SKIPPED
[INFO] Apache CloudStack Plugin - Network Netscaler ...... SKIPPED
[INFO] Apache CloudStack Plugin - Network Nicira NVP ..... SKIPPED
[INFO] Apache CloudStack Plugin - BigSwitch Virtual Network Segment  SKIPPED
[INFO] Apache CloudStack Plugin - Network Brocade VCS .... SKIPPED
[INFO] Apache CloudStack Plugin - Midokura Midonet ....... SKIPPED
[INFO] Apache CloudStack Plugin - Stratosphere SSP ....... SKIPPED
[INFO] Apache CloudStack Plugin - Network Opendaylight ... SKIPPED
[INFO] Apache CloudStack Plugin - Power Management Driver ipmitool  SKIPPED
[INFO] Apache CloudStack Plugin - Storage Allocator Random  SKIPPED
[INFO] Apache CloudStack Plugin - User Authenticator LDAP  SKIPPED
[INFO] Apache CloudStack Plugin - User Authenticator MD5 . SKIPPED
[INFO] Apache CloudStack Plugin - User Authenticator PBKDF2-SHA-256  SKIPPED
[INFO] Apache CloudStack Plugin - User Authenticator Plain Text  SKIPPED
[INFO] Apache CloudStack Plugin - User Authenticator SAML2  SKIPPED
[INFO] Apache CloudStack Plugin - User Authenticator SHA256 Salted  SKIPPED
[INFO] Apache CloudStack Plugin - Dns Notifier Example ... SKIPPED
[INFO] Apache CloudStack Plugin - Storage Image S3 provider  SKIPPED
[INFO] Apache CloudStack Plugin - Storage Image Swift provider  SKIPPED
[INFO] Apache CloudStack Plugin - Storage Image default provider  SKIPPED
[INFO] Apache CloudStack Plugin - Storage Image sample provider  SKIPPED
[INFO] Apache CloudStack Plugin - Storage Volume Nexenta Provider  SKIPPED
[INFO] Apache CloudStack Plugin - Storage Volume CloudByte Provider  SKIPPED
[INFO] Apache CloudStack Plugin - Storage Volume sample provider  SKIPPED
[INFO] Apache CloudStack Plugin - SNMP Alerts ............ SKIPPED
[INFO] Apache CloudStack Plugin - Syslog Alerts .......... SKIPPED
[INFO] Apache CloudStack Plugin - Network VXLAN .......... SKIPPED
[INFO] Apache CloudStack Plugin - GloboDNS ............... SKIPPED
[INFO] Apache CloudStack Plugin - Quota Service .......... SKIPPED
[INFO] Apache CloudStack Plugin - NetApp File System ..... SKIPPED
[INFO] Apache CloudStack Plugin - F5 ..................... SKIPPED
[INFO] Apache CloudStack Plugin - Juniper SRX ............ SKIPPED
[INFO] Apache CloudStack Plugin - Nuage VSP .............. SKIPPED
[INFO] Apache CloudStack VMware Base ..................... SKIPPED
[INFO] Apache CloudStack Plugin - Hypervisor VMware ...... SKIPPED
[INFO] Apache CloudStack Plugin - Cisco VNMC ............. SKIPPED
[INFO] Apache CloudStack Plugin - MySQL HA Strategy ...... SKIPPED
[INFO] Apache CloudStack Framework - Spring Module ....... SKIPPED
[INFO] Apache CloudStack Secondary Storage Controller .... SKIPPED
[INFO] Apache CloudStack Client UI ....................... SKIPPED
[INFO] Apache CloudStack Console Proxy - RDP Client ...... SKIPPED
[INFO] Apache CloudStack Console Proxy ................... SKIPPED
[INFO] Apache CloudStack Console Proxy - Server .......... SKIPPED
[INFO] Apache CloudStack Framework - QuickCloud .......... SKIPPED
[INFO] ------------------------------------------------------------------------
[INFO] BUILD FAILURE
[INFO] ------------------------------------------------------------------------
[INFO] Total time: 18:18.856s
[INFO] Finished at: Fri May 13 07:48:23 UTC 2016
[INFO] Final Memory: 146M/674M
[INFO] ------------------------------------------------------------------------
[ERROR] Failed to execute goal org.apache.maven.plugins:maven-surefire-plugin:2.18.1:test
(default-test) on project cloud-server: Execution default-test of goal org.apache.maven.plugins:maven-surefire-plugin:2.18.1:test
failed: There was an error in the forked process
[ERROR] java.lang.OutOfMemoryError: PermGen space
[ERROR] at java.lang.ClassLoader.defineClass1(Native Method)
[ERROR] at java.lang.ClassLoader.defineClass(ClassLoader.java:800)
[ERROR] at java.security.SecureClassLoader.defineClass(SecureClassLoader.java:142)
[ERROR] at java.net.URLClassLoader.defineClass(URLClassLoader.java:449)
[ERROR] at java.net.URLClassLoader.access$100(URLClassLoader.java:71)
[ERROR] at java.net.URLClassLoader$1.run(URLClassLoader.java:361)
[ERROR] at java.net.URLClassLoader$1.run(URLClassLoader.java:355)
[ERROR] at java.security.AccessController.doPrivileged(Native Method)
[ERROR] at java.net.URLClassLoader.findClass(URLClassLoader.java:354)
[ERROR] at java.lang.ClassLoader.loadClass(ClassLoader.java:425)
[ERROR] at sun.misc.Launcher$AppClassLoader.loadClass(Launcher.java:308)
[ERROR] at java.lang.ClassLoader.loadClass(ClassLoader.java:358)
[ERROR] at org.apache.maven.surefire.report.SmartStackTraceParser.getString(SmartStackTraceParser.java:99)
[ERROR] at org.apache.maven.surefire.report.PojoStackTraceWriter.smartTrimmedStackTrace(PojoStackTraceWriter.java:66)
[ERROR] at org.apache.maven.surefire.booter.ForkingRunListener.encode(ForkingRunListener.java:328)
[ERROR] at org.apache.maven.surefire.booter.ForkingRunListener.encode(ForkingRunListener.java:312)
[ERROR] at org.apache.maven.surefire.booter.ForkingRunListener.toString(ForkingRunListener.java:258)
[ERROR] at org.apache.maven.surefire.booter.ForkingRunListener.testError(ForkingRunListener.java:132)
[ERROR] at org.apache.maven.surefire.junit4.JUnit4Provider.executeTestSet(JUnit4Provider.java:158)
[ERROR] at org.apache.maven.surefire.junit4.JUnit4Provider.invoke(JUnit4Provider.java:128)
[ERROR] at org.apache.maven.surefire.booter.ForkedBooter.invokeProviderInSameClassLoader(ForkedBooter.java:203)
[ERROR] at org.apache.maven.surefire.booter.ForkedBooter.runSuitesInProcess(ForkedBooter.java:155)
[ERROR] at org.apache.maven.surefire.booter.ForkedBooter.main(ForkedBooter.java:103)
[ERROR] -> [Help 1]
[ERROR] 
[ERROR] To see the full stack trace of the errors, re-run Maven with the -e switch.
[ERROR] Re-run Maven using the -X switch to enable full debug logging.
[ERROR] 
[ERROR] For more information about the errors and possible solutions, please read the following
articles:
[ERROR] [Help 1] http://cwiki.apache.org/confluence/display/MAVEN/PluginExecutionException
[ERROR] 
[ERROR] After correcting the problems, you can resume the build with the command
[ERROR]   mvn <goals> -rf :cloud-server
Build step 'Invoke top-level Maven targets' marked build as failure
FATAL: hudson.remoting.Channel$OrderlyShutdown
hudson.remoting.RequestAbortedException: hudson.remoting.Channel$OrderlyShutdown
	at hudson.remoting.Request.abort(Request.java:297)
	at hudson.remoting.Channel.terminate(Channel.java:847)
	at hudson.remoting.Channel$CloseCommand.execute(Channel.java:1080)
	at hudson.remoting.Channel$1.handle(Channel.java:501)
	at hudson.remoting.SynchronousCommandTransport$ReaderThread.run(SynchronousCommandTransport.java:60)
	at ......remote call to coohq-slave-01(Native Method)
	at hudson.remoting.Channel.attachCallSiteStackTrace(Channel.java:1416)
	at hudson.remoting.Request.call(Request.java:172)
	at hudson.remoting.Channel.call(Channel.java:780)
	at hudson.Launcher$RemoteLauncher.kill(Launcher.java:953)
	at hudson.model.AbstractBuild$AbstractBuildExecution.run(AbstractBuild.java:540)
	at hudson.model.Run.execute(Run.java:1738)
	at hudson.model.FreeStyleBuild.run(FreeStyleBuild.java:43)
	at hudson.model.ResourceController.execute(ResourceController.java:98)
	at hudson.model.Executor.run(Executor.java:410)
Caused by: hudson.remoting.Channel$OrderlyShutdown
	at hudson.remoting.Channel$CloseCommand.execute(Channel.java:1080)
	at hudson.remoting.Channel$1.handle(Channel.java:501)
	at hudson.remoting.SynchronousCommandTransport$ReaderThread.run(SynchronousCommandTransport.java:60)
Caused by: Command close created at
	at hudson.remoting.Command.<init>(Command.java:56)
	at hudson.remoting.Channel$CloseCommand.<init>(Channel.java:1074)
	at hudson.remoting.Channel$CloseCommand.<init>(Channel.java:1072)
	at hudson.remoting.Channel.close(Channel.java:1156)
	at hudson.remoting.Channel.close(Channel.java:1138)
	at hudson.remoting.Channel$CloseCommand.execute(Channel.java:1079)
	... 2 more
[FINDBUGS] Skipping publisher since build result is FAILURE
Skipping Cobertura coverage report as build was not UNSTABLE or better ...

Mime
View raw message