cloudstack-dev mailing list archives

Site index · List index
Message view « Date » · « Thread »
Top « Date » · « Thread »
From jenk...@cloudstack.org
Subject Build failed in Jenkins: build-master-slowbuild #3541
Date Thu, 21 Apr 2016 04:01:26 GMT
See <http://jenkins.buildacloud.org/job/build-master-slowbuild/3541/>

------------------------------------------
[...truncated 5610 lines...]
Tests run: 3, Failures: 0, Errors: 0, Skipped: 0, Time elapsed: 0.046 sec - in com.cloud.consoleproxy.ConsoleProxyManagerTest
Running com.cloud.capacity.CapacityManagerTest
Tests run: 1, Failures: 0, Errors: 0, Skipped: 0, Time elapsed: 0.018 sec - in com.cloud.capacity.CapacityManagerTest
Running com.cloud.server.ManagementServerImplTest
Tests run: 2, Failures: 0, Errors: 0, Skipped: 0, Time elapsed: 0.048 sec - in com.cloud.server.ManagementServerImplTest
Running com.cloud.server.ConfigurationServerImplTest
ERROR  updateSystemvmPassword, Cannot retrieve systemvm password
java.sql.SQLException: No suitable driver found for jdbc:mysql://localhost:3306/cloud?autoReconnect=true&prepStmtCacheSize=517&cachePrepStmts=true&prepStmtCacheSqlLimit=4096
	at java.sql.DriverManager.getConnection(DriverManager.java:596)
	at java.sql.DriverManager.getConnection(DriverManager.java:215)
	at org.apache.commons.dbcp.DriverManagerConnectionFactory.createConnection(DriverManagerConnectionFactory.java:75)
	at org.apache.commons.dbcp.PoolableConnectionFactory.makeObject(PoolableConnectionFactory.java:582)
	at org.apache.commons.pool.impl.GenericObjectPool.borrowObject(GenericObjectPool.java:1188)
	at org.apache.commons.dbcp.PoolingDataSource.getConnection(PoolingDataSource.java:106)
	at com.cloud.utils.db.TransactionLegacy.getConnection(TransactionLegacy.java:546)
	at com.cloud.utils.db.TransactionLegacy.prepareStatement(TransactionLegacy.java:457)
	at com.cloud.utils.db.TransactionLegacy.prepareAutoCloseStatement(TransactionLegacy.java:450)
	at com.cloud.server.ConfigurationServerImpl.updateSystemvmPassword(ConfigurationServerImpl.java:676)
	at com.cloud.server.ConfigurationServerImplTest.testUpdateSystemvmPassword(ConfigurationServerImplTest.java:158)
	at sun.reflect.NativeMethodAccessorImpl.invoke0(Native Method)
	at sun.reflect.NativeMethodAccessorImpl.invoke(NativeMethodAccessorImpl.java:57)
	at sun.reflect.DelegatingMethodAccessorImpl.invoke(DelegatingMethodAccessorImpl.java:43)
	at java.lang.reflect.Method.invoke(Method.java:606)
	at org.junit.runners.model.FrameworkMethod$1.runReflectiveCall(FrameworkMethod.java:47)
	at org.junit.internal.runners.model.ReflectiveCallable.run(ReflectiveCallable.java:12)
	at org.junit.runners.model.FrameworkMethod.invokeExplosively(FrameworkMethod.java:44)
	at org.junit.internal.runners.statements.InvokeMethod.evaluate(InvokeMethod.java:17)
	at org.junit.runners.ParentRunner.runLeaf(ParentRunner.java:271)
	at org.junit.runners.BlockJUnit4ClassRunner.runChild(BlockJUnit4ClassRunner.java:70)
	at org.junit.runners.BlockJUnit4ClassRunner.runChild(BlockJUnit4ClassRunner.java:50)
	at org.junit.runners.ParentRunner$3.run(ParentRunner.java:238)
	at org.junit.runners.ParentRunner$1.schedule(ParentRunner.java:63)
	at org.junit.runners.ParentRunner.runChildren(ParentRunner.java:236)
	at org.junit.runners.ParentRunner.access$000(ParentRunner.java:53)
	at org.junit.runners.ParentRunner$2.evaluate(ParentRunner.java:229)
	at org.junit.runners.ParentRunner.run(ParentRunner.java:309)
	at org.mockito.internal.runners.JUnit45AndHigherRunnerImpl.run(JUnit45AndHigherRunnerImpl.java:37)
	at org.mockito.runners.MockitoJUnitRunner.run(MockitoJUnitRunner.java:62)
	at org.apache.maven.surefire.junit4.JUnit4Provider.execute(JUnit4Provider.java:283)
	at org.apache.maven.surefire.junit4.JUnit4Provider.executeWithRerun(JUnit4Provider.java:173)
	at org.apache.maven.surefire.junit4.JUnit4Provider.executeTestSet(JUnit4Provider.java:153)
	at org.apache.maven.surefire.junit4.JUnit4Provider.invoke(JUnit4Provider.java:128)
	at org.apache.maven.surefire.booter.ForkedBooter.invokeProviderInSameClassLoader(ForkedBooter.java:203)
	at org.apache.maven.surefire.booter.ForkedBooter.runSuitesInProcess(ForkedBooter.java:155)
	at org.apache.maven.surefire.booter.ForkedBooter.main(ForkedBooter.java:103)
Tests run: 5, Failures: 0, Errors: 0, Skipped: 0, Time elapsed: 0.06 sec - in com.cloud.server.ConfigurationServerImplTest
Running com.cloud.template.TemplateManagerImplTest
ERROR  prepareTemplateForCreate, Unable to find a secondary storage host who has completely
downloaded the template.
WARN   prepareTemplate, Skip loading template 202 into primary storage 2 as either the pool
zone 1 is different from the requested zone 1 or the pool is currently not available.
Tests run: 8, Failures: 0, Errors: 0, Skipped: 0, Time elapsed: 3.405 sec - in com.cloud.template.TemplateManagerImplTest
Running com.cloud.keystore.KeystoreTest
org.apache.cloudstack.api.response.UserVmResponse/null/{"id":"3","securitygroup":[],"nic":[],"affinitygroup":[],"tags":[]}
org.apache.cloudstack.api.response.AlertResponse/null/{"id":"100","description":"Hello"}
Tests run: 1, Failures: 0, Errors: 0, Skipped: 0, Time elapsed: 0.029 sec - in com.cloud.keystore.KeystoreTest
Running com.cloud.storage.VolumeApiServiceImplTest
Tests run: 17, Failures: 0, Errors: 0, Skipped: 0, Time elapsed: 0.18 sec - in com.cloud.storage.VolumeApiServiceImplTest
Running com.cloud.storage.ImageStoreDetailsUtilTest
Tests run: 5, Failures: 0, Errors: 0, Skipped: 0, Time elapsed: 0.016 sec - in com.cloud.storage.ImageStoreDetailsUtilTest
Running com.cloud.storage.snapshot.SnapshotManagerTest
Tests run: 8, Failures: 0, Errors: 0, Skipped: 0, Time elapsed: 0.083 sec - in com.cloud.storage.snapshot.SnapshotManagerTest
Running com.cloud.api.query.dao.SecurityGroupJoinDaoImplTest
Tests run: 6, Failures: 0, Errors: 0, Skipped: 0, Time elapsed: 0.12 sec - in com.cloud.api.query.dao.SecurityGroupJoinDaoImplTest
Running com.cloud.api.query.dao.VolumeJoinDaoImplTest
Tests run: 1, Failures: 0, Errors: 0, Skipped: 0, Time elapsed: 1.547 sec - in com.cloud.api.query.dao.VolumeJoinDaoImplTest
Running com.cloud.api.query.dao.TemplateJoinDaoImplTest
Tests run: 1, Failures: 0, Errors: 0, Skipped: 0, Time elapsed: 1.351 sec - in com.cloud.api.query.dao.TemplateJoinDaoImplTest
Running com.cloud.api.query.dao.UserVmJoinDaoImplTest
Tests run: 1, Failures: 0, Errors: 0, Skipped: 0, Time elapsed: 1.74 sec - in com.cloud.api.query.dao.UserVmJoinDaoImplTest
Running com.cloud.api.ApiResponseHelperTest
Tests run: 1, Failures: 0, Errors: 0, Skipped: 0, Time elapsed: 0.007 sec - in com.cloud.api.ApiResponseHelperTest
Running com.cloud.api.dispatch.CommandCreationWorkerTest
Tests run: 1, Failures: 0, Errors: 0, Skipped: 0, Time elapsed: 0.005 sec - in com.cloud.api.dispatch.CommandCreationWorkerTest
Running com.cloud.api.dispatch.ParamGenericValidationWorkerTest
Tests run: 4, Failures: 0, Errors: 0, Skipped: 0, Time elapsed: 0.896 sec - in com.cloud.api.dispatch.ParamGenericValidationWorkerTest
Running com.cloud.api.dispatch.ParamProcessWorkerTest
Tests run: 1, Failures: 0, Errors: 0, Skipped: 0, Time elapsed: 0.011 sec - in com.cloud.api.dispatch.ParamProcessWorkerTest
Running com.cloud.api.dispatch.DispatchChainFactoryTest
Tests run: 1, Failures: 0, Errors: 0, Skipped: 0, Time elapsed: 0.002 sec - in com.cloud.api.dispatch.DispatchChainFactoryTest
Running com.cloud.api.dispatch.SpecificCmdValidationWorkerTest
Tests run: 1, Failures: 0, Errors: 0, Skipped: 0, Time elapsed: 0.003 sec - in com.cloud.api.dispatch.SpecificCmdValidationWorkerTest
Running com.cloud.api.ApiServletTest
Tests run: 0, Failures: 0, Errors: 0, Skipped: 0, Time elapsed: 2.51 sec - in com.cloud.api.ApiServletTest
Exception in thread "Thread-1" java.lang.OutOfMemoryError: PermGen space
Exception in thread "Thread-14" java.lang.OutOfMemoryError: PermGen space
Exception in thread "Thread-13" java.lang.OutOfMemoryError: PermGen space
Exception in thread "Thread-12" java.lang.OutOfMemoryError: PermGen space

Results :

Tests run: 210, Failures: 0, Errors: 0, Skipped: 3

[INFO] ------------------------------------------------------------------------
[INFO] Reactor Summary:
[INFO] 
[INFO] Apache CloudStack Developer Tools - Checkstyle Configuration  SUCCESS [1.914s]
[INFO] Apache CloudStack ................................. SUCCESS [2.259s]
[INFO] Apache CloudStack Maven Conventions Parent ........ SUCCESS [0.792s]
[INFO] Apache CloudStack Framework - Managed Context ..... SUCCESS [19.311s]
[INFO] Apache CloudStack Utils ........................... SUCCESS [1:29.896s]
[INFO] Apache CloudStack Framework ....................... SUCCESS [0.100s]
[INFO] Apache CloudStack Framework - Event Notification .. SUCCESS [55.678s]
[INFO] Apache CloudStack Framework - Configuration ....... SUCCESS [28.170s]
[INFO] Apache CloudStack API ............................. SUCCESS [1:53.535s]
[INFO] Apache CloudStack Framework - REST ................ SUCCESS [17.514s]
[INFO] Apache CloudStack Framework - IPC ................. SUCCESS [31.196s]
[INFO] Apache CloudStack Cloud Engine .................... SUCCESS [0.091s]
[INFO] Apache CloudStack Cloud Engine API ................ SUCCESS [29.448s]
[INFO] Apache CloudStack Framework - Security ............ SUCCESS [24.699s]
[INFO] Apache CloudStack Core ............................ SUCCESS [1:23.574s]
[INFO] Apache CloudStack Agents .......................... SUCCESS [38.280s]
[INFO] Apache CloudStack Framework - Clustering .......... SUCCESS [38.698s]
[INFO] Apache CloudStack Framework - Event Notification .. SUCCESS [15.381s]
[INFO] Apache CloudStack Cloud Engine Schema Component ... SUCCESS [2:11.333s]
[INFO] Apache CloudStack Framework - Jobs ................ SUCCESS [41.988s]
[INFO] Apache CloudStack Cloud Engine Internal Components API  SUCCESS [25.849s]
[INFO] Apache CloudStack Server .......................... FAILURE [4:17.549s]
[INFO] Apache CloudStack Framework - Quota ............... SKIPPED
[INFO] Apache CloudStack Usage Server .................... SKIPPED
[INFO] Apache CloudStack Cloud Engine Orchestration Component  SKIPPED
[INFO] Apache CloudStack Cloud Services .................. SKIPPED
[INFO] Apache CloudStack Secondary Storage ............... SKIPPED
[INFO] Apache CloudStack Secondary Storage Service ....... SKIPPED
[INFO] Apache CloudStack Engine Storage Component ........ SKIPPED
[INFO] Apache CloudStack Engine Storage Volume Component . SKIPPED
[INFO] Apache CloudStack Engine Storage Image Component .. SKIPPED
[INFO] Apache CloudStack Engine Storage Data Motion Component  SKIPPED
[INFO] Apache CloudStack Engine Storage Cache Component .. SKIPPED
[INFO] Apache CloudStack Engine Storage Snapshot Component  SKIPPED
[INFO] Apache CloudStack Cloud Engine API ................ SKIPPED
[INFO] Apache CloudStack Cloud Engine Service ............ SKIPPED
[INFO] Apache CloudStack Plugin POM ...................... SKIPPED
[INFO] Apache CloudStack Plugin - API Rate Limit ......... SKIPPED
[INFO] Apache CloudStack Plugin - Storage Volume default provider  SKIPPED
[INFO] Apache CloudStack Plugin - Storage Volume SolidFire Provider  SKIPPED
[INFO] Apache CloudStack Plugin - API SolidFire .......... SKIPPED
[INFO] Apache CloudStack Plugin - API Discovery .......... SKIPPED
[INFO] Apache CloudStack Plugin - ACL Static Role Based .. SKIPPED
[INFO] Apache CloudStack Plugin - Host Anti-Affinity Processor  SKIPPED
[INFO] Apache CloudStack Plugin - Explicit Dedication Processor  SKIPPED
[INFO] Apache CloudStack Plugin - User Concentrated Pod Deployment Planner  SKIPPED
[INFO] Apache CloudStack Plugin - User Dispersing Deployment Planner  SKIPPED
[INFO] Apache CloudStack Plugin - Implicit Dedication Planner  SKIPPED
[INFO] Apache CloudStack Plugin - Skip Heurestics Planner  SKIPPED
[INFO] Apache CloudStack Plugin - Host Allocator Random .. SKIPPED
[INFO] Apache CloudStack Plugin - Dedicated Resources .... SKIPPED
[INFO] Apache CloudStack Plugin - Hypervisor OracleVM .... SKIPPED
[INFO] Apache CloudStack Plugin - Open vSwitch ........... SKIPPED
[INFO] Apache CloudStack Plugin - Hypervisor XenServer ... SKIPPED
[INFO] Apache CloudStack Plugin - Hypervisor KVM ......... SKIPPED
[INFO] Apache CloudStack Plugin - RabbitMQ Event Bus ..... SKIPPED
[INFO] Apache CloudStack Plugin - In Memory Event Bus .... SKIPPED
[INFO] Apache CloudStack Plugin - Kafka Event Bus ........ SKIPPED
[INFO] Apache CloudStack Plugin - Hypervisor Baremetal ... SKIPPED
[INFO] Apache CloudStack Plugin - Hypervisor UCS ......... SKIPPED
[INFO] Apache CloudStack Plugin - Hypervisor Hyper-V ..... SKIPPED
[INFO] Apache CloudStack Plugin - Hypervisor OracleVM3 ... SKIPPED
[INFO] Apache CloudStack Plugin - Network Elastic Load Balancer  SKIPPED
[INFO] Apache CloudStack Plugin - Network Internal Load Balancer  SKIPPED
[INFO] Apache CloudStack Framework - Spring Life Cycle ... SKIPPED
[INFO] Apache CloudStack Plugin - Network Juniper Contrail  SKIPPED
[INFO] Apache CloudStack Plugin - Palo Alto .............. SKIPPED
[INFO] Apache CloudStack Plugin - Network Netscaler ...... SKIPPED
[INFO] Apache CloudStack Plugin - Network Nicira NVP ..... SKIPPED
[INFO] Apache CloudStack Plugin - BigSwitch Virtual Network Segment  SKIPPED
[INFO] Apache CloudStack Plugin - Network Brocade VCS .... SKIPPED
[INFO] Apache CloudStack Plugin - Midokura Midonet ....... SKIPPED
[INFO] Apache CloudStack Plugin - Stratosphere SSP ....... SKIPPED
[INFO] Apache CloudStack Plugin - Network Opendaylight ... SKIPPED
[INFO] Apache CloudStack Plugin - Storage Allocator Random  SKIPPED
[INFO] Apache CloudStack Plugin - User Authenticator LDAP  SKIPPED
[INFO] Apache CloudStack Plugin - User Authenticator MD5 . SKIPPED
[INFO] Apache CloudStack Plugin - User Authenticator PBKDF2-SHA-256  SKIPPED
[INFO] Apache CloudStack Plugin - User Authenticator Plain Text  SKIPPED
[INFO] Apache CloudStack Plugin - User Authenticator SAML2  SKIPPED
[INFO] Apache CloudStack Plugin - User Authenticator SHA256 Salted  SKIPPED
[INFO] Apache CloudStack Plugin - Dns Notifier Example ... SKIPPED
[INFO] Apache CloudStack Plugin - Storage Image S3 provider  SKIPPED
[INFO] Apache CloudStack Plugin - Storage Image Swift provider  SKIPPED
[INFO] Apache CloudStack Plugin - Storage Image default provider  SKIPPED
[INFO] Apache CloudStack Plugin - Storage Image sample provider  SKIPPED
[INFO] Apache CloudStack Plugin - Storage Volume Nexenta Provider  SKIPPED
[INFO] Apache CloudStack Plugin - Storage Volume CloudByte Provider  SKIPPED
[INFO] Apache CloudStack Plugin - Storage Volume sample provider  SKIPPED
[INFO] Apache CloudStack Plugin - SNMP Alerts ............ SKIPPED
[INFO] Apache CloudStack Plugin - Syslog Alerts .......... SKIPPED
[INFO] Apache CloudStack Plugin - Network VXLAN .......... SKIPPED
[INFO] Apache CloudStack Plugin - GloboDNS ............... SKIPPED
[INFO] Apache CloudStack Plugin - Quota Service .......... SKIPPED
[INFO] Apache CloudStack Plugin - NetApp File System ..... SKIPPED
[INFO] Apache CloudStack Plugin - F5 ..................... SKIPPED
[INFO] Apache CloudStack Plugin - Juniper SRX ............ SKIPPED
[INFO] Apache CloudStack Plugin - Nuage VSP .............. SKIPPED
[INFO] Apache CloudStack VMware Base ..................... SKIPPED
[INFO] Apache CloudStack Plugin - Hypervisor VMware ...... SKIPPED
[INFO] Apache CloudStack Plugin - Cisco VNMC ............. SKIPPED
[INFO] Apache CloudStack Plugin - MySQL HA Strategy ...... SKIPPED
[INFO] Apache CloudStack Framework - Spring Module ....... SKIPPED
[INFO] Apache CloudStack Secondary Storage Controller .... SKIPPED
[INFO] Apache CloudStack Client UI ....................... SKIPPED
[INFO] Apache CloudStack Console Proxy - RDP Client ...... SKIPPED
[INFO] Apache CloudStack Console Proxy ................... SKIPPED
[INFO] Apache CloudStack Console Proxy - Server .......... SKIPPED
[INFO] Apache CloudStack Framework - QuickCloud .......... SKIPPED
[INFO] ------------------------------------------------------------------------
[INFO] BUILD FAILURE
[INFO] ------------------------------------------------------------------------
[INFO] Total time: 17:29.641s
[INFO] Finished at: Thu Apr 21 04:09:34 UTC 2016
[INFO] Final Memory: 145M/649M
[INFO] ------------------------------------------------------------------------
[ERROR] Failed to execute goal org.apache.maven.plugins:maven-surefire-plugin:2.18.1:test
(default-test) on project cloud-server: Execution default-test of goal org.apache.maven.plugins:maven-surefire-plugin:2.18.1:test
failed: There was an error in the forked process
[ERROR] java.lang.OutOfMemoryError: PermGen space
[ERROR] at java.lang.ClassLoader.defineClass1(Native Method)
[ERROR] at java.lang.ClassLoader.defineClass(ClassLoader.java:800)
[ERROR] at java.security.SecureClassLoader.defineClass(SecureClassLoader.java:142)
[ERROR] at java.net.URLClassLoader.defineClass(URLClassLoader.java:449)
[ERROR] at java.net.URLClassLoader.access$100(URLClassLoader.java:71)
[ERROR] at java.net.URLClassLoader$1.run(URLClassLoader.java:361)
[ERROR] at java.net.URLClassLoader$1.run(URLClassLoader.java:355)
[ERROR] at java.security.AccessController.doPrivileged(Native Method)
[ERROR] at java.net.URLClassLoader.findClass(URLClassLoader.java:354)
[ERROR] at java.lang.ClassLoader.loadClass(ClassLoader.java:425)
[ERROR] at sun.misc.Launcher$AppClassLoader.loadClass(Launcher.java:308)
[ERROR] at java.lang.ClassLoader.loadClass(ClassLoader.java:358)
[ERROR] at org.apache.maven.surefire.report.SmartStackTraceParser.getMinimalThrowableMiniMessage(SmartStackTraceParser.java:169)
[ERROR] at org.apache.maven.surefire.report.SmartStackTraceParser.getString(SmartStackTraceParser.java:154)
[ERROR] at org.apache.maven.surefire.report.PojoStackTraceWriter.smartTrimmedStackTrace(PojoStackTraceWriter.java:66)
[ERROR] at org.apache.maven.surefire.booter.ForkingRunListener.encode(ForkingRunListener.java:328)
[ERROR] at org.apache.maven.surefire.booter.ForkingRunListener.encode(ForkingRunListener.java:312)
[ERROR] at org.apache.maven.surefire.booter.ForkingRunListener.toString(ForkingRunListener.java:258)
[ERROR] at org.apache.maven.surefire.booter.ForkingRunListener.testError(ForkingRunListener.java:132)
[ERROR] at org.apache.maven.surefire.junit4.JUnit4Provider.executeTestSet(JUnit4Provider.java:158)
[ERROR] at org.apache.maven.surefire.junit4.JUnit4Provider.invoke(JUnit4Provider.java:128)
[ERROR] at org.apache.maven.surefire.booter.ForkedBooter.invokeProviderInSameClassLoader(ForkedBooter.java:203)
[ERROR] at org.apache.maven.surefire.booter.ForkedBooter.runSuitesInProcess(ForkedBooter.java:155)
[ERROR] at org.apache.maven.surefire.booter.ForkedBooter.main(ForkedBooter.java:103)
[ERROR] -> [Help 1]
[ERROR] 
[ERROR] To see the full stack trace of the errors, re-run Maven with the -e switch.
[ERROR] Re-run Maven using the -X switch to enable full debug logging.
[ERROR] 
[ERROR] For more information about the errors and possible solutions, please read the following
articles:
[ERROR] [Help 1] http://cwiki.apache.org/confluence/display/MAVEN/PluginExecutionException
[ERROR] 
[ERROR] After correcting the problems, you can resume the build with the command
[ERROR]   mvn <goals> -rf :cloud-server
Build step 'Invoke top-level Maven targets' marked build as failure
[FINDBUGS] Skipping publisher since build result is FAILURE
Skipping Cobertura coverage report as build was not UNSTABLE or better ...

Mime
View raw message