cloudstack-dev mailing list archives

Site index · List index
Message view « Date » · « Thread »
Top « Date » · « Thread »
From jenk...@cloudstack.org
Subject Build failed in Jenkins: build-master-jdk18 #488
Date Fri, 26 Feb 2016 17:02:54 GMT
See <http://jenkins.buildacloud.org/job/build-master-jdk18/488/>

------------------------------------------
[...truncated 425 lines...]
Tests run: 10, Failures: 0, Errors: 0, Skipped: 1, Time elapsed: 0.529 sec - in com.cloud.utils.ScriptTest
Running com.cloud.utils.log.CglibThrowableRendererTest
Tests run: 1, Failures: 0, Errors: 0, Skipped: 0, Time elapsed: 0.195 sec - in com.cloud.utils.log.CglibThrowableRendererTest
Running com.cloud.utils.UuidUtilsTest
Tests run: 2, Failures: 0, Errors: 0, Skipped: 0, Time elapsed: 0.029 sec - in com.cloud.utils.UuidUtilsTest
Running com.cloud.utils.crypto.RSAHelperTest
2016-02-26 17:11:43,162 INFO  [utils.crypt.RSAHelper] (main:) [ignored]error during public
key encryption: Unsupported format
Tests run: 2, Failures: 0, Errors: 0, Skipped: 0, Time elapsed: 0.845 sec - in com.cloud.utils.crypto.RSAHelperTest
Running com.cloud.utils.crypto.EncryptionSecretKeyCheckerTest
2016-02-26 17:11:43,298 DEBUG [utils.crypt.EncryptionSecretKeyChecker] (main:) Encryption
Type: null
2016-02-26 17:11:43,298 DEBUG [utils.crypt.EncryptionSecretKeyChecker] (main:) Encryption
Type: file
Tests run: 1, Failures: 0, Errors: 0, Skipped: 0, Time elapsed: 0.029 sec - in com.cloud.utils.crypto.EncryptionSecretKeyCheckerTest
Running com.cloud.utils.PropertiesUtilsTest
Tests run: 4, Failures: 0, Errors: 0, Skipped: 0, Time elapsed: 0.028 sec - in com.cloud.utils.PropertiesUtilsTest
Running com.cloud.utils.exception.ExceptionUtilTest
Tests run: 1, Failures: 0, Errors: 0, Skipped: 0, Time elapsed: 0 sec - in com.cloud.utils.exception.ExceptionUtilTest
Running com.cloud.utils.storage.QCOW2UtilsTest
Tests run: 2, Failures: 0, Errors: 0, Skipped: 0, Time elapsed: 0.001 sec - in com.cloud.utils.storage.QCOW2UtilsTest
Running com.cloud.utils.encoding.UrlEncoderTest
Tests run: 1, Failures: 0, Errors: 0, Skipped: 0, Time elapsed: 0.002 sec - in com.cloud.utils.encoding.UrlEncoderTest
Running com.cloud.utils.UriUtilsTest
Tests run: 2, Failures: 0, Errors: 0, Skipped: 0, Time elapsed: 0.043 sec - in com.cloud.utils.UriUtilsTest
Running com.cloud.utils.HttpUtilsTest
Tests run: 2, Failures: 0, Errors: 0, Skipped: 0, Time elapsed: 0.11 sec - in com.cloud.utils.HttpUtilsTest
Running com.cloud.utils.backoff.impl.ConstantTimeBackoffTest
2016-02-26 17:11:43,620 INFO  [backoff.impl.ConstantTimeBackoff] (Thread-1:) Thread Thread-1
interrupted while waiting for retry
2016-02-26 17:11:43,723 DEBUG [backoff.impl.ConstantTimeBackoffTest] (main:) thread started
2016-02-26 17:11:43,723 DEBUG [backoff.impl.ConstantTimeBackoffTest] (Thread-2:) before
2016-02-26 17:11:43,824 DEBUG [backoff.impl.ConstantTimeBackoffTest] (main:) testing wakeup
Tests run: 6, Failures: 0, Errors: 0, Skipped: 0, Time elapsed: 0.318 sec - in com.cloud.utils.backoff.impl.ConstantTimeBackoffTest
Running com.cloud.utils.ProcessUtilTest
2016-02-26 17:11:43,827 INFO  [backoff.impl.ConstantTimeBackoff] (Thread-2:) Thread Thread-2
interrupted while waiting for retry
2016-02-26 17:11:43,827 DEBUG [backoff.impl.ConstantTimeBackoffTest] (Thread-2:) after
2016-02-26 17:11:43,832 DEBUG [cloud.utils.ProcessUtil] (main:) environment.properties could
not be opened
2016-02-26 17:11:43,844 DEBUG [cloud.utils.ProcessUtil] (main:) environment.properties could
not be opened
2016-02-26 17:11:43,845 DEBUG [cloud.utils.ProcessUtil] (main:) Executing: bash -c ps -p 123456

2016-02-26 17:11:43,946 DEBUG [cloud.utils.ProcessUtil] (main:) Exit value is 1
2016-02-26 17:11:43,946 DEBUG [cloud.utils.ProcessUtil] (main:)   PID TTY          TIME CMD
2016-02-26 17:11:43,947 DEBUG [cloud.utils.ProcessUtil] (main:) Executing: bash -c echo $PPID

2016-02-26 17:11:43,950 DEBUG [cloud.utils.ProcessUtil] (main:) Execution is successful.
2016-02-26 17:11:43,960 DEBUG [cloud.utils.ProcessUtil] (main:) environment.properties could
not be opened
Tests run: 3, Failures: 0, Errors: 0, Skipped: 0, Time elapsed: 0.143 sec - in com.cloud.utils.ProcessUtilTest
Running com.cloud.utils.PasswordGeneratorTest
Tests run: 1, Failures: 0, Errors: 0, Skipped: 0, Time elapsed: 0 sec - in com.cloud.utils.PasswordGeneratorTest
Running com.cloud.utils.rest.HttpUriRequestBuilderTest
Tests run: 7, Failures: 0, Errors: 0, Skipped: 0, Time elapsed: 0.056 sec - in com.cloud.utils.rest.HttpUriRequestBuilderTest
Running com.cloud.utils.rest.HttpStatusCodeHelperTest
Tests run: 2, Failures: 0, Errors: 0, Skipped: 0, Time elapsed: 0 sec - in com.cloud.utils.rest.HttpStatusCodeHelperTest
Running com.cloud.utils.rest.RESTServiceConnectorTest
2016-02-26 17:11:44,232 DEBUG [utils.rest.RESTServiceConnector] (main:) Executing retrieve
object on /somepath
2016-02-26 17:11:44,233 DEBUG [utils.rest.BasicRestClient] (main:) Executig GET request on
https://localhost:443/somepath
2016-02-26 17:11:44,243 DEBUG [utils.rest.RESTServiceConnector] (main:) Executed request:
GET /somepath HTTP/1.1 status was HTTP/1.1 200 OK
2016-02-26 17:11:44,274 DEBUG [utils.rest.BasicRestClient] (main:) Closing HTTP connection
2016-02-26 17:11:44,292 DEBUG [utils.rest.RESTServiceConnector] (main:) Executing create object
on /somepath
2016-02-26 17:11:44,292 DEBUG [utils.rest.RESTServiceConnector] (main:) Built request 'POST
/somepath HTTP/1.1' with payload: Optional.of({"field":"newValue"})
2016-02-26 17:11:44,292 DEBUG [utils.rest.BasicRestClient] (main:) Executig POST request on
https://localhost:443/somepath
2016-02-26 17:11:44,293 DEBUG [utils.rest.RESTServiceConnector] (main:) Executed request:
POST /somepath HTTP/1.1 status was HTTP/1.1 200 OK
2016-02-26 17:11:44,299 DEBUG [utils.rest.BasicRestClient] (main:) Closing HTTP connection
2016-02-26 17:11:44,332 DEBUG [utils.rest.RESTServiceConnector] (main:) Executing create object
on /somepath
2016-02-26 17:11:44,332 DEBUG [utils.rest.RESTServiceConnector] (main:) Built request 'POST
/somepath?arg2=val2&arg1=val1 HTTP/1.1' with payload: Optional.of({"field":"newValue"})
2016-02-26 17:11:44,332 DEBUG [utils.rest.BasicRestClient] (main:) Executig POST request on
https://localhost:443/somepath?arg2=val2&arg1=val1
2016-02-26 17:11:44,333 DEBUG [utils.rest.RESTServiceConnector] (main:) Executed request:
POST /somepath?arg2=val2&arg1=val1 HTTP/1.1 status was HTTP/1.1 200 OK
2016-02-26 17:11:44,333 DEBUG [utils.rest.BasicRestClient] (main:) Closing HTTP connection
2016-02-26 17:11:44,343 DEBUG [utils.rest.RESTServiceConnector] (main:) Executing update object
on /somepath
2016-02-26 17:11:44,344 DEBUG [utils.rest.RESTServiceConnector] (main:) Built request 'PUT
/somepath?arg2=val2&arg1=val1 HTTP/1.1' with payload: Optional.of({"field":"newValue"})
2016-02-26 17:11:44,344 DEBUG [utils.rest.BasicRestClient] (main:) Executig PUT request on
https://localhost:443/somepath?arg2=val2&arg1=val1
2016-02-26 17:11:44,344 DEBUG [utils.rest.RESTServiceConnector] (main:) Executed request:
PUT /somepath?arg2=val2&arg1=val1 HTTP/1.1 status was HTTP/1.1 200 OK
2016-02-26 17:11:44,344 DEBUG [utils.rest.BasicRestClient] (main:) Closing HTTP connection
2016-02-26 17:11:44,638 DEBUG [utils.rest.RESTServiceConnector] (main:) Executing retrieve
object on /somepath
2016-02-26 17:11:44,638 DEBUG [utils.rest.BasicRestClient] (main:) Executig GET request on
https://localhost:443/somepath
2016-02-26 17:11:44,639 DEBUG [utils.rest.RESTServiceConnector] (main:) Executed request:
GET /somepath HTTP/1.1 status was HTTP/1.1 200 OK
2016-02-26 17:11:44,643 DEBUG [utils.rest.BasicRestClient] (main:) Closing HTTP connection
2016-02-26 17:11:44,645 DEBUG [utils.rest.RESTServiceConnector] (main:) Executing update object
on /somepath
2016-02-26 17:11:44,646 DEBUG [utils.rest.RESTServiceConnector] (main:) Built request 'PUT
/somepath HTTP/1.1' with payload: Optional.of({"field":"newValue"})
2016-02-26 17:11:44,646 DEBUG [utils.rest.BasicRestClient] (main:) Executig PUT request on
https://localhost:443/somepath
2016-02-26 17:11:44,646 DEBUG [utils.rest.RESTServiceConnector] (main:) Executed request:
PUT /somepath HTTP/1.1 status was HTTP/1.1 200 OK
2016-02-26 17:11:44,646 DEBUG [utils.rest.BasicRestClient] (main:) Closing HTTP connection
2016-02-26 17:11:44,667 DEBUG [utils.rest.RESTServiceConnector] (main:) Executing delete object
on /somepath
2016-02-26 17:11:44,667 DEBUG [utils.rest.BasicRestClient] (main:) Executig DELETE request
on https://localhost:443/somepath
2016-02-26 17:11:44,667 DEBUG [utils.rest.RESTServiceConnector] (main:) Executed request:
DELETE /somepath HTTP/1.1 status was HTTP/1.1 200 OK
2016-02-26 17:11:44,668 DEBUG [utils.rest.BasicRestClient] (main:) Closing HTTP connection
2016-02-26 17:11:44,676 DEBUG [utils.rest.RESTServiceConnector] (main:) Executing retrieve
object on /somepath
2016-02-26 17:11:44,676 DEBUG [utils.rest.BasicRestClient] (main:) Executig GET request on
https://localhost:443/somepath?arg2=val2&arg1=val1
2016-02-26 17:11:44,676 DEBUG [utils.rest.RESTServiceConnector] (main:) Executed request:
GET /somepath?arg2=val2&arg1=val1 HTTP/1.1 status was HTTP/1.1 200 OK
2016-02-26 17:11:44,677 DEBUG [utils.rest.BasicRestClient] (main:) Closing HTTP connection
2016-02-26 17:11:44,683 DEBUG [utils.rest.RESTServiceConnector] (main:) Executing retrieve
object on /somepath
2016-02-26 17:11:44,684 DEBUG [utils.rest.BasicRestClient] (main:) Executig GET request on
https://localhost:443/somepath
2016-02-26 17:11:44,684 DEBUG [utils.rest.RESTServiceConnector] (main:) Executed request:
GET /somepath HTTP/1.1 status was HTTP/1.1 200 OK
2016-02-26 17:11:44,685 DEBUG [utils.rest.BasicRestClient] (main:) Closing HTTP connection
Tests run: 9, Failures: 0, Errors: 0, Skipped: 0, Time elapsed: 0.656 sec - in com.cloud.utils.rest.RESTServiceConnectorTest
Running com.cloud.utils.rest.BasicRestClientTest
2016-02-26 17:11:45,687 DEBUG [utils.rest.BasicRestClient] (main:) Executig GET request on
https://fakelocalhost.fakelocaldomain:443/path
2016-02-26 17:11:45,714 DEBUG [utils.rest.BasicRestClient] (main:) Executig GET request on
https://fakelocalhost.fakelocaldomain:443/path
2016-02-26 17:11:45,931 DEBUG [utils.rest.BasicRestClient] (main:) Executig GET request on
https://fakelocalhost.fakelocaldomain:443/path
Tests run: 3, Failures: 0, Errors: 0, Skipped: 0, Time elapsed: 1.255 sec - in com.cloud.utils.rest.BasicRestClientTest
Running com.cloud.utils.rest.HttpClientHelperTest
Tests run: 1, Failures: 0, Errors: 0, Skipped: 0, Time elapsed: 0.012 sec - in com.cloud.utils.rest.HttpClientHelperTest
Running com.cloud.utils.StringUtilsTest
Tests run: 27, Failures: 0, Errors: 0, Skipped: 0, Time elapsed: 0.106 sec - in com.cloud.utils.StringUtilsTest
Running com.cloud.utils.ReflectUtilTest
Tests run: 7, Failures: 0, Errors: 0, Skipped: 0, Time elapsed: 0.057 sec - in com.cloud.utils.ReflectUtilTest
Running org.apache.cloudstack.utils.hypervisor.HypervisorUtilsTest
Testing don't block on newly created clones - pass
Testing block on modified files - Testing timeout of blocking on modified files - pass
Tests run: 3, Failures: 1, Errors: 0, Skipped: 0, Time elapsed: 4.986 sec <<< FAILURE!
- in org.apache.cloudstack.utils.hypervisor.HypervisorUtilsTest
checkVolumeFileForActivityTest(org.apache.cloudstack.utils.hypervisor.HypervisorUtilsTest)
 Time elapsed: 1.831 sec  <<< FAILURE!
java.lang.AssertionError: Didn't block long enough, expected at least 2000 and got 1750
	at org.junit.Assert.fail(Assert.java:88)
	at org.junit.Assert.assertTrue(Assert.java:41)
	at org.junit.Assert.assertFalse(Assert.java:64)
	at org.apache.cloudstack.utils.hypervisor.HypervisorUtilsTest.checkVolumeFileForActivityTest(HypervisorUtilsTest.java:68)

Running org.apache.cloudstack.utils.imagestore.ImageStoreUtilTest
Tests run: 1, Failures: 0, Errors: 0, Skipped: 0, Time elapsed: 0.004 sec - in org.apache.cloudstack.utils.imagestore.ImageStoreUtilTest

Results :

Failed tests: 
  HypervisorUtilsTest.checkVolumeFileForActivityTest:68 Didn't block long enough, expected
at least 2000 and got 1750

Tests run: 173, Failures: 1, Errors: 0, Skipped: 1

[INFO] ------------------------------------------------------------------------
[INFO] Reactor Summary:
[INFO] 
[INFO] Apache CloudStack Developer Tools - Checkstyle Configuration  SUCCESS [4.471s]
[INFO] Apache CloudStack ................................. SUCCESS [4.799s]
[INFO] Apache CloudStack Maven Conventions Parent ........ SUCCESS [7.850s]
[INFO] Apache CloudStack Framework - Managed Context ..... SUCCESS [10.111s]
[INFO] Apache CloudStack Utils ........................... FAILURE [51.455s]
[INFO] Apache CloudStack Framework ....................... SKIPPED
[INFO] Apache CloudStack Framework - Event Notification .. SKIPPED
[INFO] Apache CloudStack Framework - Configuration ....... SKIPPED
[INFO] Apache CloudStack API ............................. SKIPPED
[INFO] Apache CloudStack Framework - REST ................ SKIPPED
[INFO] Apache CloudStack Framework - IPC ................. SKIPPED
[INFO] Apache CloudStack Cloud Engine .................... SKIPPED
[INFO] Apache CloudStack Cloud Engine API ................ SKIPPED
[INFO] Apache CloudStack Framework - Security ............ SKIPPED
[INFO] Apache CloudStack Core ............................ SKIPPED
[INFO] Apache CloudStack Agents .......................... SKIPPED
[INFO] Apache CloudStack Framework - Clustering .......... SKIPPED
[INFO] Apache CloudStack Framework - Event Notification .. SKIPPED
[INFO] Apache CloudStack Cloud Engine Schema Component ... SKIPPED
[INFO] Apache CloudStack Framework - Jobs ................ SKIPPED
[INFO] Apache CloudStack Cloud Engine Internal Components API  SKIPPED
[INFO] Apache CloudStack Server .......................... SKIPPED
[INFO] Apache CloudStack Framework - Quota ............... SKIPPED
[INFO] Apache CloudStack Usage Server .................... SKIPPED
[INFO] Apache CloudStack Cloud Engine Orchestration Component  SKIPPED
[INFO] Apache CloudStack Cloud Services .................. SKIPPED
[INFO] Apache CloudStack Secondary Storage ............... SKIPPED
[INFO] Apache CloudStack Secondary Storage Service ....... SKIPPED
[INFO] Apache CloudStack Engine Storage Component ........ SKIPPED
[INFO] Apache CloudStack Engine Storage Volume Component . SKIPPED
[INFO] Apache CloudStack Engine Storage Image Component .. SKIPPED
[INFO] Apache CloudStack Engine Storage Data Motion Component  SKIPPED
[INFO] Apache CloudStack Engine Storage Cache Component .. SKIPPED
[INFO] Apache CloudStack Engine Storage Snapshot Component  SKIPPED
[INFO] Apache CloudStack Cloud Engine API ................ SKIPPED
[INFO] Apache CloudStack Cloud Engine Service ............ SKIPPED
[INFO] Apache CloudStack Plugin POM ...................... SKIPPED
[INFO] Apache CloudStack Plugin - API Rate Limit ......... SKIPPED
[INFO] Apache CloudStack Plugin - Storage Volume default provider  SKIPPED
[INFO] Apache CloudStack Plugin - Storage Volume SolidFire Provider  SKIPPED
[INFO] Apache CloudStack Plugin - API SolidFire .......... SKIPPED
[INFO] Apache CloudStack Plugin - API Discovery .......... SKIPPED
[INFO] Apache CloudStack Plugin - ACL Static Role Based .. SKIPPED
[INFO] Apache CloudStack Plugin - Host Anti-Affinity Processor  SKIPPED
[INFO] Apache CloudStack Plugin - Explicit Dedication Processor  SKIPPED
[INFO] Apache CloudStack Plugin - User Concentrated Pod Deployment Planner  SKIPPED
[INFO] Apache CloudStack Plugin - User Dispersing Deployment Planner  SKIPPED
[INFO] Apache CloudStack Plugin - Implicit Dedication Planner  SKIPPED
[INFO] Apache CloudStack Plugin - Skip Heurestics Planner  SKIPPED
[INFO] Apache CloudStack Plugin - Host Allocator Random .. SKIPPED
[INFO] Apache CloudStack Plugin - Dedicated Resources .... SKIPPED
[INFO] Apache CloudStack Plugin - Hypervisor OracleVM .... SKIPPED
[INFO] Apache CloudStack Plugin - Open vSwitch ........... SKIPPED
[INFO] Apache CloudStack Plugin - Hypervisor XenServer ... SKIPPED
[INFO] Apache CloudStack Plugin - Hypervisor KVM ......... SKIPPED
[INFO] Apache CloudStack Plugin - RabbitMQ Event Bus ..... SKIPPED
[INFO] Apache CloudStack Plugin - In Memory Event Bus .... SKIPPED
[INFO] Apache CloudStack Plugin - Kafka Event Bus ........ SKIPPED
[INFO] Apache CloudStack Plugin - Hypervisor Baremetal ... SKIPPED
[INFO] Apache CloudStack Plugin - Hypervisor UCS ......... SKIPPED
[INFO] Apache CloudStack Plugin - Hypervisor Hyper-V ..... SKIPPED
[INFO] Apache CloudStack Plugin - Hypervisor OracleVM3 ... SKIPPED
[INFO] Apache CloudStack Plugin - Network Elastic Load Balancer  SKIPPED
[INFO] Apache CloudStack Plugin - Network Internal Load Balancer  SKIPPED
[INFO] Apache CloudStack Framework - Spring Life Cycle ... SKIPPED
[INFO] Apache CloudStack Plugin - Network Juniper Contrail  SKIPPED
[INFO] Apache CloudStack Plugin - Palo Alto .............. SKIPPED
[INFO] Apache CloudStack Plugin - Network Netscaler ...... SKIPPED
[INFO] Apache CloudStack Plugin - Network Nicira NVP ..... SKIPPED
[INFO] Apache CloudStack Plugin - BigSwitch Virtual Network Segment  SKIPPED
[INFO] Apache CloudStack Plugin - Network Brocade VCS .... SKIPPED
[INFO] Apache CloudStack Plugin - Midokura Midonet ....... SKIPPED
[INFO] Apache CloudStack Plugin - Stratosphere SSP ....... SKIPPED
[INFO] Apache CloudStack Plugin - Network Opendaylight ... SKIPPED
[INFO] Apache CloudStack Plugin - Storage Allocator Random  SKIPPED
[INFO] Apache CloudStack Plugin - User Authenticator LDAP  SKIPPED
[INFO] Apache CloudStack Plugin - User Authenticator MD5 . SKIPPED
[INFO] Apache CloudStack Plugin - User Authenticator PBKDF2-SHA-256  SKIPPED
[INFO] Apache CloudStack Plugin - User Authenticator Plain Text  SKIPPED
[INFO] Apache CloudStack Plugin - User Authenticator SAML2  SKIPPED
[INFO] Apache CloudStack Plugin - User Authenticator SHA256 Salted  SKIPPED
[INFO] Apache CloudStack Plugin - Dns Notifier Example ... SKIPPED
[INFO] Apache CloudStack Plugin - Storage Image S3 provider  SKIPPED
[INFO] Apache CloudStack Plugin - Storage Image Swift provider  SKIPPED
[INFO] Apache CloudStack Plugin - Storage Image default provider  SKIPPED
[INFO] Apache CloudStack Plugin - Storage Image sample provider  SKIPPED
[INFO] Apache CloudStack Plugin - Storage Volume Nexenta Provider  SKIPPED
[INFO] Apache CloudStack Plugin - Storage Volume CloudByte Provider  SKIPPED
[INFO] Apache CloudStack Plugin - Storage Volume sample provider  SKIPPED
[INFO] Apache CloudStack Plugin - SNMP Alerts ............ SKIPPED
[INFO] Apache CloudStack Plugin - Syslog Alerts .......... SKIPPED
[INFO] Apache CloudStack Plugin - Network VXLAN .......... SKIPPED
[INFO] Apache CloudStack Plugin - GloboDNS ............... SKIPPED
[INFO] Apache CloudStack Plugin - Quota Service .......... SKIPPED
[INFO] Apache CloudStack Framework - Spring Module ....... SKIPPED
[INFO] Apache CloudStack Secondary Storage Controller .... SKIPPED
[INFO] Apache CloudStack Console Proxy - RDP Client ...... SKIPPED
[INFO] Apache CloudStack Console Proxy ................... SKIPPED
[INFO] Apache CloudStack Console Proxy - Server .......... SKIPPED
[INFO] Apache CloudStack System VM ....................... SKIPPED
[INFO] Apache CloudStack Client UI ....................... SKIPPED
[INFO] Apache CloudStack Framework - QuickCloud .......... SKIPPED
[INFO] ------------------------------------------------------------------------
[INFO] BUILD FAILURE
[INFO] ------------------------------------------------------------------------
[INFO] Total time: 1:26.175s
[INFO] Finished at: Fri Feb 26 17:11:51 UTC 2016
[INFO] Final Memory: 47M/188M
[INFO] ------------------------------------------------------------------------
[ERROR] Failed to execute goal org.apache.maven.plugins:maven-surefire-plugin:2.18.1:test
(default-test) on project cloud-utils: There are test failures.
[ERROR] 
[ERROR] Please refer to <http://jenkins.buildacloud.org/job/build-master-jdk18/ws/utils/target/surefire-reports>
for the individual test results.
[ERROR] -> [Help 1]
[ERROR] 
[ERROR] To see the full stack trace of the errors, re-run Maven with the -e switch.
[ERROR] Re-run Maven using the -X switch to enable full debug logging.
[ERROR] 
[ERROR] For more information about the errors and possible solutions, please read the following
articles:
[ERROR] [Help 1] http://cwiki.apache.org/confluence/display/MAVEN/MojoFailureException
[ERROR] 
[ERROR] After correcting the problems, you can resume the build with the command
[ERROR]   mvn <goals> -rf :cloud-utils
Build step 'Invoke top-level Maven targets' marked build as failure
Recording test results

Mime
View raw message