cloudstack-dev mailing list archives

Site index · List index
Message view « Date » · « Thread »
Top « Date » · « Thread »
From jenk...@cloudstack.org
Subject Build failed in Jenkins: build-master-slowbuild #3082
Date Tue, 26 Jan 2016 20:06:28 GMT
See <http://jenkins.buildacloud.org/job/build-master-slowbuild/3082/>

------------------------------------------
[...truncated 824 lines...]
	at org.apache.maven.surefire.booter.ForkedBooter.runSuitesInProcess(ForkedBooter.java:155)
	at org.apache.maven.surefire.booter.ForkedBooter.main(ForkedBooter.java:103)
2016-01-26 20:13:05,436 DEBUG [utils.script.Script] (main:) Executing: /bin/bash -c /not/existing/scripts/1453839185436

2016-01-26 20:13:05,438 DEBUG [utils.script.Script] (main:) Exit value is 127
2016-01-26 20:13:05,439 DEBUG [utils.script.Script] (main:) /bin/bash: /not/existing/scripts/1453839185436:
No such file or directory
2016-01-26 20:13:05,440 DEBUG [utils.script.Script] (main:) Executing: /bin/bash -c echo 'hello
world!' 
2016-01-26 20:13:05,442 DEBUG [utils.script.Script] (main:) Execution is successful.
2016-01-26 20:13:05,444 DEBUG [utils.script.Script] (main:) Executing: /bin/bash -c echo 'hello
world!' 
2016-01-26 20:13:05,446 DEBUG [utils.script.Script] (main:) Execution is successful.
Tests run: 10, Failures: 0, Errors: 0, Skipped: 1, Time elapsed: 0.044 sec - in com.cloud.utils.ScriptTest
Running com.cloud.utils.TestProfiler
Configure log4j with default properties
2016-01-26 20:13:05,472 INFO  [cloud.utils.TestProfiler] (main:) testProfiler() started
2016-01-26 20:13:06,483 INFO  [cloud.utils.TestProfiler] (main:) Duration in Millis: 1010
2016-01-26 20:13:06,483 INFO  [cloud.utils.TestProfiler] (main:) testProfiler() stopped
Configure log4j with default properties
Configure log4j with default properties
2016-01-26 20:13:07,515 INFO  [cloud.utils.TestProfiler] (main:) Duration in Nano: 1010114313
Configure log4j with default properties
Tests run: 4, Failures: 0, Errors: 0, Skipped: 0, Time elapsed: 2.066 sec - in com.cloud.utils.TestProfiler
Running com.cloud.utils.net.NetUtilsTest
2016-01-26 20:13:07,556 INFO  [utils.net.NetUtils] (main:) Invalid value of cidr 10.3.6.5/50
2016-01-26 20:13:07,564 INFO  [utils.net.NetUtilsTest] (main:) IP is 1234:5678::2
2016-01-26 20:13:07,566 INFO  [utils.net.NetUtilsTest] (main:) IP is 1234:5678::1
2016-01-26 20:13:07,567 INFO  [utils.net.NetUtilsTest] (main:) IP is 1234:5678::2
2016-01-26 20:13:07,568 INFO  [utils.net.NetUtilsTest] (main:) IP is 1234:5678::2
2016-01-26 20:13:07,570 INFO  [utils.net.NetUtilsTest] (main:) IP is 1234:5678::1
2016-01-26 20:13:07,571 INFO  [utils.net.NetUtilsTest] (main:) IP is 1234:5678::3165:2867:4c9e:eb06
2016-01-26 20:13:07,573 INFO  [utils.net.NetUtilsTest] (main:) IP is 1234:5678::50:e349:14d4:bf54
2016-01-26 20:13:07,575 INFO  [utils.net.NetUtilsTest] (main:) IP is 1234:5678::6897:552f:3cbd:fb88
2016-01-26 20:13:07,576 INFO  [utils.net.NetUtilsTest] (main:) IP is 1234:5678::7f71:cae1:6540:fcdc
2016-01-26 20:13:07,578 INFO  [utils.net.NetUtilsTest] (main:) IP is 1234:5678::df1d:bce9:8eae:4667
2016-01-26 20:13:07,580 INFO  [utils.net.NetUtilsTest] (main:) IP is 1234:5678::c55d:e29e:f12b:e976
2016-01-26 20:13:07,581 INFO  [utils.net.NetUtilsTest] (main:) IP is 1234:5678::e704:bf0e:ec3b:9adc
2016-01-26 20:13:07,583 INFO  [utils.net.NetUtilsTest] (main:) IP is 1234:5678::89be:b9e8:e458:fc48
2016-01-26 20:13:07,584 INFO  [utils.net.NetUtilsTest] (main:) IP is 1234:5678::95a1:e2c4:512f:8250
2016-01-26 20:13:07,586 INFO  [utils.net.NetUtilsTest] (main:) IP is 1234:5678::bfdf:1543:470b:f504
2016-01-26 20:13:07,603 ERROR [utils.net.NetUtils] (main:) empty cidr can not be converted
to longs
com.cloud.utils.exception.CloudRuntimeException: empty cidr can not be converted to longs
	at com.cloud.utils.net.NetUtils.cidrToLong(NetUtils.java:887)
	at com.cloud.utils.net.NetUtils.isNetworksOverlap(NetUtils.java:1174)
	at com.cloud.utils.net.NetUtilsTest.testIsNetworksOverlapWithEmptyValues(NetUtilsTest.java:509)
	at sun.reflect.NativeMethodAccessorImpl.invoke0(Native Method)
	at sun.reflect.NativeMethodAccessorImpl.invoke(NativeMethodAccessorImpl.java:57)
	at sun.reflect.DelegatingMethodAccessorImpl.invoke(DelegatingMethodAccessorImpl.java:43)
	at java.lang.reflect.Method.invoke(Method.java:606)
	at org.junit.runners.model.FrameworkMethod$1.runReflectiveCall(FrameworkMethod.java:47)
	at org.junit.internal.runners.model.ReflectiveCallable.run(ReflectiveCallable.java:12)
	at org.junit.runners.model.FrameworkMethod.invokeExplosively(FrameworkMethod.java:44)
	at org.junit.internal.runners.statements.InvokeMethod.evaluate(InvokeMethod.java:17)
	at org.junit.runners.ParentRunner.runLeaf(ParentRunner.java:271)
	at org.junit.runners.BlockJUnit4ClassRunner.runChild(BlockJUnit4ClassRunner.java:70)
	at org.junit.runners.BlockJUnit4ClassRunner.runChild(BlockJUnit4ClassRunner.java:50)
	at org.junit.runners.ParentRunner$3.run(ParentRunner.java:238)
	at org.junit.runners.ParentRunner$1.schedule(ParentRunner.java:63)
	at org.junit.runners.ParentRunner.runChildren(ParentRunner.java:236)
	at org.junit.runners.ParentRunner.access$000(ParentRunner.java:53)
	at org.junit.runners.ParentRunner$2.evaluate(ParentRunner.java:229)
	at org.junit.runners.ParentRunner.run(ParentRunner.java:309)
	at org.apache.maven.surefire.junit4.JUnit4Provider.execute(JUnit4Provider.java:283)
	at org.apache.maven.surefire.junit4.JUnit4Provider.executeWithRerun(JUnit4Provider.java:173)
	at org.apache.maven.surefire.junit4.JUnit4Provider.executeTestSet(JUnit4Provider.java:153)
	at org.apache.maven.surefire.junit4.JUnit4Provider.invoke(JUnit4Provider.java:128)
	at org.apache.maven.surefire.booter.ForkedBooter.invokeProviderInSameClassLoader(ForkedBooter.java:203)
	at org.apache.maven.surefire.booter.ForkedBooter.runSuitesInProcess(ForkedBooter.java:155)
	at org.apache.maven.surefire.booter.ForkedBooter.main(ForkedBooter.java:103)
2016-01-26 20:13:07,636 ERROR [utils.net.NetUtils] (main:) Failed to convert a string to an
IPv6 address
java.lang.IllegalArgumentException: can not parse []
	at com.googlecode.ipv6.IPv6Address.tryParseStringArrayIntoLongArray(IPv6Address.java:94)
	at com.googlecode.ipv6.IPv6Address.fromString(IPv6Address.java:80)
	at com.cloud.utils.net.NetUtils.countIp6InRange(NetUtils.java:1340)
	at com.cloud.utils.net.NetUtilsTest.testCountIp6InRangeWithNullStart(NetUtilsTest.java:154)
	at sun.reflect.NativeMethodAccessorImpl.invoke0(Native Method)
	at sun.reflect.NativeMethodAccessorImpl.invoke(NativeMethodAccessorImpl.java:57)
	at sun.reflect.DelegatingMethodAccessorImpl.invoke(DelegatingMethodAccessorImpl.java:43)
	at java.lang.reflect.Method.invoke(Method.java:606)
	at org.junit.runners.model.FrameworkMethod$1.runReflectiveCall(FrameworkMethod.java:47)
	at org.junit.internal.runners.model.ReflectiveCallable.run(ReflectiveCallable.java:12)
	at org.junit.runners.model.FrameworkMethod.invokeExplosively(FrameworkMethod.java:44)
	at org.junit.internal.runners.statements.InvokeMethod.evaluate(InvokeMethod.java:17)
	at org.junit.runners.ParentRunner.runLeaf(ParentRunner.java:271)
	at org.junit.runners.BlockJUnit4ClassRunner.runChild(BlockJUnit4ClassRunner.java:70)
	at org.junit.runners.BlockJUnit4ClassRunner.runChild(BlockJUnit4ClassRunner.java:50)
	at org.junit.runners.ParentRunner$3.run(ParentRunner.java:238)
	at org.junit.runners.ParentRunner$1.schedule(ParentRunner.java:63)
	at org.junit.runners.ParentRunner.runChildren(ParentRunner.java:236)
	at org.junit.runners.ParentRunner.access$000(ParentRunner.java:53)
	at org.junit.runners.ParentRunner$2.evaluate(ParentRunner.java:229)
	at org.junit.runners.ParentRunner.run(ParentRunner.java:309)
	at org.apache.maven.surefire.junit4.JUnit4Provider.execute(JUnit4Provider.java:283)
	at org.apache.maven.surefire.junit4.JUnit4Provider.executeWithRerun(JUnit4Provider.java:173)
	at org.apache.maven.surefire.junit4.JUnit4Provider.executeTestSet(JUnit4Provider.java:153)
	at org.apache.maven.surefire.junit4.JUnit4Provider.invoke(JUnit4Provider.java:128)
	at org.apache.maven.surefire.booter.ForkedBooter.invokeProviderInSameClassLoader(ForkedBooter.java:203)
	at org.apache.maven.surefire.booter.ForkedBooter.runSuitesInProcess(ForkedBooter.java:155)
	at org.apache.maven.surefire.booter.ForkedBooter.main(ForkedBooter.java:103)
Tests run: 54, Failures: 0, Errors: 0, Skipped: 0, Time elapsed: 0.128 sec - in com.cloud.utils.net.NetUtilsTest
Running com.cloud.utils.net.MacAddressTest
ff:ff:ff:ff:ff:ff
Tests run: 3, Failures: 0, Errors: 0, Skipped: 0, Time elapsed: 0.003 sec - in com.cloud.utils.net.MacAddressTest
Running com.cloud.utils.net.Ip4AddressTest
Tests run: 2, Failures: 0, Errors: 0, Skipped: 0, Time elapsed: 0.018 sec - in com.cloud.utils.net.Ip4AddressTest
Running com.cloud.utils.net.IpTest
Tests run: 5, Failures: 0, Errors: 0, Skipped: 0, Time elapsed: 0.002 sec - in com.cloud.utils.net.IpTest
Running com.cloud.utils.PropertiesUtilsTest
Tests run: 4, Failures: 0, Errors: 0, Skipped: 0, Time elapsed: 0.003 sec - in com.cloud.utils.PropertiesUtilsTest

Results :

Failed tests: 
  HypervisorUtilsTest.checkVolumeFileForActivityTest:68 Didn't block long enough, expected
at least 2000 and got 1004

Tests run: 173, Failures: 1, Errors: 0, Skipped: 1

[INFO] ------------------------------------------------------------------------
[INFO] Reactor Summary:
[INFO] 
[INFO] Apache CloudStack Developer Tools - Checkstyle Configuration  SUCCESS [1.783s]
[INFO] Apache CloudStack ................................. SUCCESS [2.128s]
[INFO] Apache CloudStack Maven Conventions Parent ........ SUCCESS [0.765s]
[INFO] Apache CloudStack Framework - Managed Context ..... SUCCESS [19.015s]
[INFO] Apache CloudStack Utils ........................... FAILURE [40.410s]
[INFO] Apache CloudStack Framework ....................... SKIPPED
[INFO] Apache CloudStack Framework - Event Notification .. SKIPPED
[INFO] Apache CloudStack Framework - Configuration ....... SKIPPED
[INFO] Apache CloudStack API ............................. SKIPPED
[INFO] Apache CloudStack Framework - REST ................ SKIPPED
[INFO] Apache CloudStack Framework - IPC ................. SKIPPED
[INFO] Apache CloudStack Cloud Engine .................... SKIPPED
[INFO] Apache CloudStack Cloud Engine API ................ SKIPPED
[INFO] Apache CloudStack Framework - Security ............ SKIPPED
[INFO] Apache CloudStack Core ............................ SKIPPED
[INFO] Apache CloudStack Agents .......................... SKIPPED
[INFO] Apache CloudStack Framework - Clustering .......... SKIPPED
[INFO] Apache CloudStack Framework - Event Notification .. SKIPPED
[INFO] Apache CloudStack Cloud Engine Schema Component ... SKIPPED
[INFO] Apache CloudStack Framework - Jobs ................ SKIPPED
[INFO] Apache CloudStack Cloud Engine Internal Components API  SKIPPED
[INFO] Apache CloudStack Server .......................... SKIPPED
[INFO] Apache CloudStack Framework - Quota ............... SKIPPED
[INFO] Apache CloudStack Usage Server .................... SKIPPED
[INFO] Apache CloudStack Cloud Engine Orchestration Component  SKIPPED
[INFO] Apache CloudStack Cloud Services .................. SKIPPED
[INFO] Apache CloudStack Secondary Storage ............... SKIPPED
[INFO] Apache CloudStack Secondary Storage Service ....... SKIPPED
[INFO] Apache CloudStack Engine Storage Component ........ SKIPPED
[INFO] Apache CloudStack Engine Storage Volume Component . SKIPPED
[INFO] Apache CloudStack Engine Storage Image Component .. SKIPPED
[INFO] Apache CloudStack Engine Storage Data Motion Component  SKIPPED
[INFO] Apache CloudStack Engine Storage Cache Component .. SKIPPED
[INFO] Apache CloudStack Engine Storage Snapshot Component  SKIPPED
[INFO] Apache CloudStack Cloud Engine API ................ SKIPPED
[INFO] Apache CloudStack Cloud Engine Service ............ SKIPPED
[INFO] Apache CloudStack Plugin POM ...................... SKIPPED
[INFO] Apache CloudStack Plugin - API Rate Limit ......... SKIPPED
[INFO] Apache CloudStack Plugin - Storage Volume default provider  SKIPPED
[INFO] Apache CloudStack Plugin - Storage Volume SolidFire Provider  SKIPPED
[INFO] Apache CloudStack Plugin - API SolidFire .......... SKIPPED
[INFO] Apache CloudStack Plugin - API Discovery .......... SKIPPED
[INFO] Apache CloudStack Plugin - ACL Static Role Based .. SKIPPED
[INFO] Apache CloudStack Plugin - Host Anti-Affinity Processor  SKIPPED
[INFO] Apache CloudStack Plugin - Explicit Dedication Processor  SKIPPED
[INFO] Apache CloudStack Plugin - User Concentrated Pod Deployment Planner  SKIPPED
[INFO] Apache CloudStack Plugin - User Dispersing Deployment Planner  SKIPPED
[INFO] Apache CloudStack Plugin - Implicit Dedication Planner  SKIPPED
[INFO] Apache CloudStack Plugin - Skip Heurestics Planner  SKIPPED
[INFO] Apache CloudStack Plugin - Host Allocator Random .. SKIPPED
[INFO] Apache CloudStack Plugin - Dedicated Resources .... SKIPPED
[INFO] Apache CloudStack Plugin - Hypervisor OracleVM .... SKIPPED
[INFO] Apache CloudStack Plugin - Open vSwitch ........... SKIPPED
[INFO] Apache CloudStack Plugin - Hypervisor XenServer ... SKIPPED
[INFO] Apache CloudStack Plugin - Hypervisor KVM ......... SKIPPED
[INFO] Apache CloudStack Plugin - RabbitMQ Event Bus ..... SKIPPED
[INFO] Apache CloudStack Plugin - In Memory Event Bus .... SKIPPED
[INFO] Apache CloudStack Plugin - Kafka Event Bus ........ SKIPPED
[INFO] Apache CloudStack Plugin - Hypervisor Baremetal ... SKIPPED
[INFO] Apache CloudStack Plugin - Hypervisor UCS ......... SKIPPED
[INFO] Apache CloudStack Plugin - Hypervisor Hyper-V ..... SKIPPED
[INFO] Apache CloudStack Plugin - Hypervisor OracleVM3 ... SKIPPED
[INFO] Apache CloudStack Plugin - Network Elastic Load Balancer  SKIPPED
[INFO] Apache CloudStack Plugin - Network Internal Load Balancer  SKIPPED
[INFO] Apache CloudStack Framework - Spring Life Cycle ... SKIPPED
[INFO] Apache CloudStack Plugin - Network Juniper Contrail  SKIPPED
[INFO] Apache CloudStack Plugin - Palo Alto .............. SKIPPED
[INFO] Apache CloudStack Plugin - Network Netscaler ...... SKIPPED
[INFO] Apache CloudStack Plugin - Network Nicira NVP ..... SKIPPED
[INFO] Apache CloudStack Plugin - BigSwitch Virtual Network Segment  SKIPPED
[INFO] Apache CloudStack Plugin - Network Brocade VCS .... SKIPPED
[INFO] Apache CloudStack Plugin - Midokura Midonet ....... SKIPPED
[INFO] Apache CloudStack Plugin - Stratosphere SSP ....... SKIPPED
[INFO] Apache CloudStack Plugin - Network Opendaylight ... SKIPPED
[INFO] Apache CloudStack Plugin - Storage Allocator Random  SKIPPED
[INFO] Apache CloudStack Plugin - User Authenticator LDAP  SKIPPED
[INFO] Apache CloudStack Plugin - User Authenticator MD5 . SKIPPED
[INFO] Apache CloudStack Plugin - User Authenticator PBKDF2-SHA-256  SKIPPED
[INFO] Apache CloudStack Plugin - User Authenticator Plain Text  SKIPPED
[INFO] Apache CloudStack Plugin - User Authenticator SAML2  SKIPPED
[INFO] Apache CloudStack Plugin - User Authenticator SHA256 Salted  SKIPPED
[INFO] Apache CloudStack Plugin - Dns Notifier Example ... SKIPPED
[INFO] Apache CloudStack Plugin - Storage Image S3 provider  SKIPPED
[INFO] Apache CloudStack Plugin - Storage Image Swift provider  SKIPPED
[INFO] Apache CloudStack Plugin - Storage Image default provider  SKIPPED
[INFO] Apache CloudStack Plugin - Storage Image sample provider  SKIPPED
[INFO] Apache CloudStack Plugin - Storage Volume Nexenta Provider  SKIPPED
[INFO] Apache CloudStack Plugin - Storage Volume CloudByte Provider  SKIPPED
[INFO] Apache CloudStack Plugin - Storage Volume sample provider  SKIPPED
[INFO] Apache CloudStack Plugin - SNMP Alerts ............ SKIPPED
[INFO] Apache CloudStack Plugin - Syslog Alerts .......... SKIPPED
[INFO] Apache CloudStack Plugin - Network VXLAN .......... SKIPPED
[INFO] Apache CloudStack Plugin - GloboDNS ............... SKIPPED
[INFO] Apache CloudStack Plugin - Quota Service .......... SKIPPED
[INFO] Apache CloudStack Plugin - NetApp File System ..... SKIPPED
[INFO] Apache CloudStack Plugin - F5 ..................... SKIPPED
[INFO] Apache CloudStack Plugin - Juniper SRX ............ SKIPPED
[INFO] Apache CloudStack Plugin - Nuage VSP .............. SKIPPED
[INFO] Apache CloudStack VMware Base ..................... SKIPPED
[INFO] Apache CloudStack Plugin - Hypervisor VMware ...... SKIPPED
[INFO] Apache CloudStack Plugin - Cisco VNMC ............. SKIPPED
[INFO] Apache CloudStack Plugin - MySQL HA Strategy ...... SKIPPED
[INFO] Apache CloudStack Framework - Spring Module ....... SKIPPED
[INFO] Apache CloudStack Secondary Storage Controller .... SKIPPED
[INFO] Apache CloudStack Client UI ....................... SKIPPED
[INFO] Apache CloudStack Console Proxy - RDP Client ...... SKIPPED
[INFO] Apache CloudStack Console Proxy ................... SKIPPED
[INFO] Apache CloudStack Console Proxy - Server .......... SKIPPED
[INFO] Apache CloudStack Framework - QuickCloud .......... SKIPPED
[INFO] ------------------------------------------------------------------------
[INFO] BUILD FAILURE
[INFO] ------------------------------------------------------------------------
[INFO] Total time: 1:06.683s
[INFO] Finished at: Tue Jan 26 20:13:07 UTC 2016
[INFO] Final Memory: 81M/896M
[INFO] ------------------------------------------------------------------------
[ERROR] Failed to execute goal org.apache.maven.plugins:maven-surefire-plugin:2.18.1:test
(default-test) on project cloud-utils: There are test failures.
[ERROR] 
[ERROR] Please refer to <http://jenkins.buildacloud.org/job/build-master-slowbuild/ws/utils/target/surefire-reports>
for the individual test results.
[ERROR] -> [Help 1]
[ERROR] 
[ERROR] To see the full stack trace of the errors, re-run Maven with the -e switch.
[ERROR] Re-run Maven using the -X switch to enable full debug logging.
[ERROR] 
[ERROR] For more information about the errors and possible solutions, please read the following
articles:
[ERROR] [Help 1] http://cwiki.apache.org/confluence/display/MAVEN/MojoFailureException
[ERROR] 
[ERROR] After correcting the problems, you can resume the build with the command
[ERROR]   mvn <goals> -rf :cloud-utils
Build step 'Invoke top-level Maven targets' marked build as failure
[FINDBUGS] Skipping publisher since build result is FAILURE
Skipping Cobertura coverage report as build was not UNSTABLE or better ...

Mime
View raw message