cloudstack-dev mailing list archives

Site index · List index
Message view « Date » · « Thread »
Top « Date » · « Thread »
From Sudharma Jain <sudharma....@gmail.com>
Subject Building Cloudstack failing on windows
Date Mon, 14 Dec 2015 06:25:32 GMT
While building Cloudstack on windows, it fails with following exceptions.

Tests run: 4, Failures: 1, Errors: 0, Skipped: 0, Time elapsed: 2.052 sec
<<< FAILURE! - in com.cloud.utils.TestProfiler
testProfilerInNano(com.cloud.utils.TestProfiler)  Time elapsed: 1.004 sec
 <<< FAILURE!
java.lang.AssertionError: null
        at org.junit.Assert.fail(Assert.java:86)
        at org.junit.Assert.assertTrue(Assert.java:41)
        at org.junit.Assert.assertTrue(Assert.java:52)
        at
com.cloud.utils.TestProfiler.testProfilerInNano(TestProfiler.java:71)


Tests run: 4, Failures: 1, Errors: 0, Skipped: 0, Time elapsed: 0.001 sec
<<< FAILURE! - in
com.cloud.hypervisor.kvm.resource.wrapper.LibvirtUtilitiesHelperTest
testSSHKeyPaths(com.cloud.hypervisor.kvm.resource.wrapper.LibvirtUtilitiesHelperTest)
 Time elapsed: 0.001 sec  <<< FAILURE!
junit.framework.ComparisonFailure: expected:</root/.ssh[/]id_rsa.pub.cloud>
but was:</root/.ssh[\]id_rsa.pub.cloud>
        at junit.framework.Assert.assertEquals(Assert.java:100)
        at junit.framework.Assert.assertEquals(Assert.java:107)
        at junit.framework.TestCase.assertEquals(TestCase.java:269)
        at
com.cloud.hypervisor.kvm.resource.wrapper.LibvirtUtilitiesHelperTest.testSSHKeyPaths(LibvirtUtilitiesHelperTest.java:40)

Thanks,
Sudharma

Mime
  • Unnamed multipart/alternative (inline, None, 0 bytes)
View raw message