cloudstack-dev mailing list archives

Site index · List index
Message view « Date » · « Thread »
Top « Date » · « Thread »
From jenk...@cloudstack.org
Subject Build failed in Jenkins: build-master-noredist #4760
Date Mon, 23 Nov 2015 10:54:55 GMT
See <http://jenkins.buildacloud.org/job/build-master-noredist/4760/>

------------------------------------------
[...truncated 5596 lines...]
[INFO] --- maven-compiler-plugin:3.2:testCompile (default-testCompile) @ cloud-plugin-hypervisor-baremetal
---
[INFO] No sources to compile
[INFO] 
[INFO] --- maven-surefire-plugin:2.18.1:test (default-test) @ cloud-plugin-hypervisor-baremetal
---
[INFO] 
[INFO] --- maven-jar-plugin:2.5:jar (default-jar) @ cloud-plugin-hypervisor-baremetal ---
[INFO] Building jar: <http://jenkins.buildacloud.org/job/build-master-noredist/ws/plugins/hypervisors/baremetal/target/cloud-plugin-hypervisor-baremetal-4.7.0-SNAPSHOT.jar>
[INFO] 
[INFO] --- maven-resources-plugin:2.5:testResources (default-testResources) @ cloud-plugin-network-bigswitch
---
[debug] execute contextualize
[INFO] Using 'UTF-8' encoding to copy filtered resources.
[INFO] skip non existing resourceDirectory <http://jenkins.buildacloud.org/job/build-master-noredist/ws/plugins/network-elements/bigswitch/test/resources>
[INFO] Copying 3 resources
[INFO] 
[INFO] --- maven-compiler-plugin:3.2:testCompile (default-testCompile) @ cloud-plugin-network-bigswitch
---
[INFO] Changes detected - recompiling the module!
[INFO] Compiling 3 source files to <http://jenkins.buildacloud.org/job/build-master-noredist/ws/plugins/network-elements/bigswitch/target/test-classes>
[INFO] ------------------------------------------------------------------------
[INFO] Reactor Summary:
[INFO] 
[INFO] Apache CloudStack Developer Tools - Checkstyle Configuration  SUCCESS [1.130s]
[INFO] Apache CloudStack ................................. SUCCESS [1.244s]
[INFO] Apache CloudStack Maven Conventions Parent ........ SUCCESS [0.993s]
[INFO] Apache CloudStack Framework - Managed Context ..... SUCCESS [3.403s]
[INFO] Apache CloudStack Utils ........................... SUCCESS [18.067s]
[INFO] Apache CloudStack Framework ....................... SUCCESS [0.335s]
[INFO] Apache CloudStack Framework - Event Notification .. SUCCESS [7.753s]
[INFO] Apache CloudStack Framework - Configuration ....... SUCCESS [4.298s]
[INFO] Apache CloudStack API ............................. SUCCESS [13.538s]
[INFO] Apache CloudStack Framework - REST ................ SUCCESS [4.059s]
[INFO] Apache CloudStack Framework - IPC ................. SUCCESS [4.858s]
[INFO] Apache CloudStack Cloud Engine .................... SUCCESS [0.334s]
[INFO] Apache CloudStack Cloud Engine API ................ SUCCESS [4.539s]
[INFO] Apache CloudStack Framework - Security ............ SUCCESS [2.223s]
[INFO] Apache CloudStack Core ............................ SUCCESS [24.242s]
[INFO] Apache CloudStack Agents .......................... SUCCESS [6.360s]
[INFO] Apache CloudStack Framework - Clustering .......... SUCCESS [5.042s]
[INFO] Apache CloudStack Framework - Event Notification .. SUCCESS [1.970s]
[INFO] Apache CloudStack Cloud Engine Schema Component ... SUCCESS [16.136s]
[INFO] Apache CloudStack Framework - Jobs ................ SUCCESS [5.826s]
[INFO] Apache CloudStack Cloud Engine Internal Components API  SUCCESS [2.877s]
[INFO] Apache CloudStack Server .......................... SUCCESS [42.286s]
[INFO] Apache CloudStack Usage Server .................... SUCCESS [6.749s]
[INFO] Apache CloudStack Cloud Engine Orchestration Component  SUCCESS [9.509s]
[INFO] Apache CloudStack Cloud Services .................. SUCCESS [0.334s]
[INFO] Apache CloudStack Secondary Storage ............... SUCCESS [2.596s]
[INFO] Apache CloudStack Secondary Storage Service ....... SUCCESS [8.613s]
[INFO] Apache CloudStack Engine Storage Component ........ SKIPPED
[INFO] Apache CloudStack Engine Storage Volume Component . SKIPPED
[INFO] Apache CloudStack Engine Storage Image Component .. SKIPPED
[INFO] Apache CloudStack Engine Storage Data Motion Component  SKIPPED
[INFO] Apache CloudStack Engine Storage Cache Component .. SKIPPED
[INFO] Apache CloudStack Engine Storage Snapshot Component  SKIPPED
[INFO] Apache CloudStack Cloud Engine API ................ SUCCESS [1.994s]
[INFO] Apache CloudStack Cloud Engine Service ............ SKIPPED
[INFO] Apache CloudStack Plugin POM ...................... SUCCESS [0.445s]
[INFO] Apache CloudStack Plugin - API Rate Limit ......... SUCCESS [10.420s]
[INFO] Apache CloudStack Plugin - Storage Volume default provider  SKIPPED
[INFO] Apache CloudStack Plugin - Storage Volume SolidFire Provider  SKIPPED
[INFO] Apache CloudStack Plugin - API SolidFire .......... SKIPPED
[INFO] Apache CloudStack Plugin - API Discovery .......... SUCCESS [11.962s]
[INFO] Apache CloudStack Plugin - ACL Static Role Based .. SUCCESS [19.621s]
[INFO] Apache CloudStack Plugin - Host Anti-Affinity Processor  SUCCESS [9.789s]
[INFO] Apache CloudStack Plugin - Explicit Dedication Processor  SUCCESS [3.891s]
[INFO] Apache CloudStack Plugin - User Concentrated Pod Deployment Planner  SUCCESS [15.116s]
[INFO] Apache CloudStack Plugin - User Dispersing Deployment Planner  SUCCESS [19.588s]
[INFO] Apache CloudStack Plugin - Implicit Dedication Planner  SUCCESS [19.658s]
[INFO] Apache CloudStack Plugin - Skip Heurestics Planner  SUCCESS [19.585s]
[INFO] Apache CloudStack Plugin - Host Allocator Random .. SUCCESS [14.663s]
[INFO] Apache CloudStack Plugin - Dedicated Resources .... SKIPPED
[INFO] Apache CloudStack Plugin - Hypervisor OracleVM .... SUCCESS [21.547s]
[INFO] Apache CloudStack Plugin - Open vSwitch ........... SUCCESS [10.672s]
[INFO] Apache CloudStack Plugin - Hypervisor XenServer ... SKIPPED
[INFO] Apache CloudStack Plugin - Hypervisor KVM ......... SKIPPED
[INFO] Apache CloudStack Plugin - RabbitMQ Event Bus ..... SUCCESS [19.693s]
[INFO] Apache CloudStack Plugin - In Memory Event Bus .... SUCCESS [25.866s]
[INFO] Apache CloudStack Plugin - Kafka Event Bus ........ SUCCESS [15.237s]
[INFO] Apache CloudStack Plugin - Hypervisor Baremetal ... SKIPPED
[INFO] Apache CloudStack Plugin - Hypervisor UCS ......... SUCCESS [21.713s]
[INFO] Apache CloudStack Plugin - Hypervisor Hyper-V ..... SKIPPED
[INFO] Apache CloudStack Plugin - Hypervisor OracleVM3 ... SKIPPED
[INFO] Apache CloudStack Plugin - Network Elastic Load Balancer  SKIPPED
[INFO] Apache CloudStack Plugin - Network Internal Load Balancer  SKIPPED
[INFO] Apache CloudStack Framework - Spring Life Cycle ... SUCCESS [2.338s]
[INFO] Apache CloudStack Plugin - Network Juniper Contrail  SKIPPED
[INFO] Apache CloudStack Plugin - Palo Alto .............. SKIPPED
[INFO] Apache CloudStack Plugin - Network Netscaler ...... SUCCESS [22.540s]
[INFO] Apache CloudStack Plugin - Network Nicira NVP ..... SKIPPED
[INFO] Apache CloudStack Plugin - BigSwitch Virtual Network Segment  SKIPPED
[INFO] Apache CloudStack Plugin - Network Brocade VCS .... SKIPPED
[INFO] Apache CloudStack Plugin - Midokura Midonet ....... SKIPPED
[INFO] Apache CloudStack Plugin - Stratosphere SSP ....... SKIPPED
[INFO] Apache CloudStack Plugin - Network Opendaylight ... SKIPPED
[INFO] Apache CloudStack Plugin - Storage Allocator Random  SKIPPED
[INFO] Apache CloudStack Plugin - User Authenticator LDAP  SUCCESS [25.579s]
[INFO] Apache CloudStack Plugin - User Authenticator MD5 . SKIPPED
[INFO] Apache CloudStack Plugin - User Authenticator PBKDF2-SHA-256  SKIPPED
[INFO] Apache CloudStack Plugin - User Authenticator Plain Text  SUCCESS [13.475s]
[INFO] Apache CloudStack Plugin - User Authenticator SAML2  SKIPPED
[INFO] Apache CloudStack Plugin - User Authenticator SHA256 Salted  SKIPPED
[INFO] Apache CloudStack Plugin - Dns Notifier Example ... SUCCESS [15.067s]
[INFO] Apache CloudStack Plugin - Storage Image S3 provider  SKIPPED
[INFO] Apache CloudStack Plugin - Storage Image Swift provider  SKIPPED
[INFO] Apache CloudStack Plugin - Storage Image default provider  SKIPPED
[INFO] Apache CloudStack Plugin - Storage Image sample provider  SKIPPED
[INFO] Apache CloudStack Plugin - Storage Volume Nexenta Provider  SKIPPED
[INFO] Apache CloudStack Plugin - Storage Volume CloudByte Provider  SKIPPED
[INFO] Apache CloudStack Plugin - Storage Volume sample provider  SKIPPED
[INFO] Apache CloudStack Plugin - SNMP Alerts ............ SKIPPED
[INFO] Apache CloudStack Plugin - Syslog Alerts .......... SKIPPED
[INFO] Apache CloudStack Plugin - Network VXLAN .......... SKIPPED
[INFO] Apache CloudStack Plugin - GloboDNS ............... SKIPPED
[INFO] Apache CloudStack Plugin - NetApp File System ..... SKIPPED
[INFO] Apache CloudStack Plugin - F5 ..................... SKIPPED
[INFO] Apache CloudStack Plugin - Juniper SRX ............ FAILURE [1.891s]
[INFO] Apache CloudStack Plugin - Nuage VSP .............. FAILURE [2.449s]
[INFO] Apache CloudStack VMware Base ..................... SUCCESS [8.798s]
[INFO] Apache CloudStack Plugin - Hypervisor VMware ...... SKIPPED
[INFO] Apache CloudStack Plugin - Cisco VNMC ............. SKIPPED
[INFO] Apache CloudStack Plugin - MySQL HA Strategy ...... SKIPPED
[INFO] Apache CloudStack Framework - Spring Module ....... SUCCESS [6.722s]
[INFO] Apache CloudStack Secondary Storage Controller .... SUCCESS [4.331s]
[INFO] Apache CloudStack Console Proxy - RDP Client ...... SUCCESS [9.556s]
[INFO] Apache CloudStack Console Proxy ................... SUCCESS [2.507s]
[INFO] Apache CloudStack Console Proxy - Server .......... SUCCESS [4.928s]
[INFO] Apache CloudStack System VM ....................... SKIPPED
[INFO] Apache CloudStack Client UI ....................... SKIPPED
[INFO] Apache CloudStack Framework - QuickCloud .......... SUCCESS [0.767s]
[INFO] ------------------------------------------------------------------------
[INFO] BUILD FAILURE
[INFO] ------------------------------------------------------------------------
[INFO] Total time: 2:38.446s (Wall Clock)
[INFO] Finished at: Mon Nov 23 10:58:55 UTC 2015
[INFO] Final Memory: 101M/997M
[INFO] ------------------------------------------------------------------------
[WARNING] The requested profile "awsapi" could not be activated because it does not exist.
[INFO] 
[INFO] --- maven-surefire-plugin:2.18.1:test (default-test) @ cloud-plugin-user-authenticator-sha256salted
---
[INFO] 
[INFO] --- maven-surefire-plugin:2.18.1:test (default-test) @ cloud-plugin-network-internallb
---
[INFO] 
[INFO] --- maven-resources-plugin:2.5:testResources (default-testResources) @ cloud-plugin-snmp-alerts
---
[debug] execute contextualize
Tests run: 3, Failures: 0, Errors: 0, Skipped: 0, Time elapsed: 2.836 sec - in org.apache.cloudstack.network.element.SspClientTest
[INFO] 
[INFO] --- maven-resources-plugin:2.5:testResources (default-testResources) @ cloud-plugin-hypervisor-hyperv
---
[INFO] 
[INFO] --- maven-surefire-plugin:2.18.1:test (default-test) @ cloud-plugin-dedicated-resources
---

Results :

Tests run: 5, Failures: 0, Errors: 0, Skipped: 0

[INFO] 
[INFO] --- maven-jar-plugin:2.5:jar (default-jar) @ cloud-plugin-network-ssp ---
[ERROR] Failed to execute goal org.apache.maven.plugins:maven-checkstyle-plugin:2.11:check
(cloudstack-checkstyle) on project cloud-plugin-network-srx: Failed during checkstyle execution:
There are 1 checkstyle errors. -> [Help 1]
[INFO] 
[INFO] --- maven-surefire-plugin:2.18.1:test (default-test) @ cloud-plugin-network-palo-alto
---
[INFO] 
[INFO] --- maven-surefire-plugin:2.18.1:test (default-test) @ cloud-plugin-network-elb ---
[INFO] 
[INFO] --- maven-surefire-plugin:2.18.1:test (default-test) @ cloud-plugin-user-authenticator-md5
---
[debug] execute contextualize
[INFO] Using 'UTF-8' encoding to copy filtered resources.
[INFO] skip non existing resourceDirectory <http://jenkins.buildacloud.org/job/build-master-noredist/ws/plugins/hypervisors/hyperv/test/resources>
[INFO] Copying 3 resources
[INFO] 
[INFO] --- maven-compiler-plugin:3.2:testCompile (default-testCompile) @ cloud-plugin-hypervisor-hyperv
---
[INFO] 
[INFO] --- maven-site-plugin:3.1:attach-descriptor (attach-descriptor) @ cloud-plugin-hypervisor-baremetal
---
[INFO] Surefire report directory: <http://jenkins.buildacloud.org/job/build-master-noredist/ws/plugins/network-elements/palo-alto/target/surefire-reports>
[INFO] 
[INFO] --- maven-install-plugin:2.3.1:install (default-install) @ cloud-plugin-hypervisor-baremetal
---

-------------------------------------------------------
 T E S T S
-------------------------------------------------------
[INFO] Installing <http://jenkins.buildacloud.org/job/build-master-noredist/ws/plugins/hypervisors/baremetal/target/cloud-plugin-hypervisor-baremetal-4.7.0-SNAPSHOT.jar>
to /home/jenkins/.m2/repository/org/apache/cloudstack/cloud-plugin-hypervisor-baremetal/4.7.0-SNAPSHOT/cloud-plugin-hypervisor-baremetal-4.7.0-SNAPSHOT.jar
[INFO] Installing <http://jenkins.buildacloud.org/job/build-master-noredist/ws/plugins/hypervisors/baremetal/pom.xml>
to /home/jenkins/.m2/repository/org/apache/cloudstack/cloud-plugin-hypervisor-baremetal/4.7.0-SNAPSHOT/cloud-plugin-hypervisor-baremetal-4.7.0-SNAPSHOT.pom
[INFO] Using 'UTF-8' encoding to copy filtered resources.
[INFO] skip non existing resourceDirectory <http://jenkins.buildacloud.org/job/build-master-noredist/ws/plugins/alert-handlers/snmp-alerts/test/resources>
[INFO] Copying 3 resources
[INFO] Surefire report directory: <http://jenkins.buildacloud.org/job/build-master-noredist/ws/plugins/user-authenticators/sha256salted/target/surefire-reports>
[INFO] Surefire report directory: <http://jenkins.buildacloud.org/job/build-master-noredist/ws/plugins/user-authenticators/md5/target/surefire-reports>

-------------------------------------------------------
 T E S T S
-------------------------------------------------------
[INFO] 
[INFO] --- maven-compiler-plugin:3.2:testCompile (default-testCompile) @ cloud-plugin-snmp-alerts
---
[INFO] Surefire report directory: <http://jenkins.buildacloud.org/job/build-master-noredist/ws/plugins/network-elements/elastic-loadbalancer/target/surefire-reports>
[INFO] Surefire report directory: <http://jenkins.buildacloud.org/job/build-master-noredist/ws/plugins/network-elements/internal-loadbalancer/target/surefire-reports>
[INFO] Changes detected - recompiling the module!

-------------------------------------------------------
 T E S T S
-------------------------------------------------------
Running org.apache.cloudstack.server.auth.PBKD2UserAuthenticatorTest
[INFO] Compiling 1 source file to <http://jenkins.buildacloud.org/job/build-master-noredist/ws/plugins/hypervisors/hyperv/target/test-classes>
[INFO] 
[INFO] --- maven-resources-plugin:2.5:testResources (default-testResources) @ cloud-plugin-hypervisor-ovm3
---
[debug] execute contextualize

-------------------------------------------------------
 T E S T S
-------------------------------------------------------
[INFO] Using 'UTF-8' encoding to copy filtered resources.
[ERROR] Failed to execute goal org.apache.maven.plugins:maven-checkstyle-plugin:2.11:check
(cloudstack-checkstyle) on project cloud-plugin-network-vsp: Failed during checkstyle execution:
There are 1 checkstyle errors. -> [Help 1]
[ERROR] 
[ERROR] To see the full stack trace of the errors, re-run Maven with the -e switch.
[ERROR] Re-run Maven using the -X switch to enable full debug logging.
[ERROR] 
[ERROR] For more information about the errors and possible solutions, please read the following
articles:
[ERROR] [Help 1] http://cwiki.apache.org/confluence/display/MAVEN/MojoExecutionException
[ERROR] 
[ERROR] After correcting the problems, you can resume the build with the command
[ERROR]   mvn <goals> -rf :cloud-plugin-network-srx
[INFO] Copying 10 resources
[INFO] Copying 3 resources
[INFO] Changes detected - recompiling the module!
[INFO] Surefire report directory: <http://jenkins.buildacloud.org/job/build-master-noredist/ws/plugins/dedicated-resources/target/surefire-reports>
[INFO] 
[INFO] --- maven-compiler-plugin:3.2:testCompile (default-testCompile) @ cloud-plugin-hypervisor-ovm3
---
[INFO] Compiling 2 source files to <http://jenkins.buildacloud.org/job/build-master-noredist/ws/plugins/alert-handlers/snmp-alerts/target/test-classes>

-------------------------------------------------------
 T E S T S
-------------------------------------------------------
[INFO] Building jar: <http://jenkins.buildacloud.org/job/build-master-noredist/ws/plugins/network-elements/stratosphere-ssp/target/cloud-plugin-network-ssp-4.7.0-SNAPSHOT.jar>

-------------------------------------------------------
 T E S T S
-------------------------------------------------------
[INFO] 
[INFO] --- maven-resources-plugin:2.5:testResources (default-testResources) @ cloud-plugin-network-nvp
---
[INFO] 
[INFO] --- maven-resources-plugin:2.5:testResources (default-testResources) @ cloud-plugin-database-mysqlha
---
Destroying 8 processes
Destroying process..
Destroying process..
Destroying process..
Destroying process..
Destroying process..
Destroying process..
Destroying process..
Destroying process..
Destroyed 8 processes
Build step 'Invoke top-level Maven targets' marked build as failure
Archiving artifacts

Mime
View raw message