cloudstack-dev mailing list archives

Site index · List index
Message view « Date » · « Thread »
Top « Date » · « Thread »
From jenk...@cloudstack.org
Subject Build failed in Jenkins: build-master-noredist #4758
Date Mon, 23 Nov 2015 10:37:07 GMT
See <http://jenkins.buildacloud.org/job/build-master-noredist/4758/changes>

Changes:

[Daan Hoogland] CID 1338016: multi catch instead of pokemon

[Rajani Karuturi] CLOUDSTACK-8951: validation for "remote.access.vpn.psk.length"

[lucascristofolini] Removed unnecessary @Local annotations and their respective imports from

------------------------------------------
[...truncated 5562 lines...]
[INFO] Copying 3 resources
[INFO] 
[INFO] --- maven-compiler-plugin:3.2:testCompile (default-testCompile) @ cloud-plugin-hypervisor-baremetal
---
[INFO] No sources to compile
[INFO] 
[INFO] --- maven-surefire-plugin:2.18.1:test (default-test) @ cloud-plugin-hypervisor-baremetal
---
[INFO] 
[INFO] --- maven-jar-plugin:2.5:jar (default-jar) @ cloud-plugin-hypervisor-baremetal ---
[INFO] ------------------------------------------------------------------------
[INFO] Reactor Summary:
[INFO] 
[INFO] Apache CloudStack Developer Tools - Checkstyle Configuration  SUCCESS [2.361s]
[INFO] Apache CloudStack ................................. SUCCESS [2.446s]
[INFO] Apache CloudStack Maven Conventions Parent ........ SUCCESS [1.118s]
[INFO] Apache CloudStack Framework - Managed Context ..... SUCCESS [3.885s]
[INFO] Apache CloudStack Utils ........................... SUCCESS [19.013s]
[INFO] Apache CloudStack Framework ....................... SUCCESS [0.421s]
[INFO] Apache CloudStack Framework - Event Notification .. SUCCESS [9.116s]
[INFO] Apache CloudStack Framework - Configuration ....... SUCCESS [4.191s]
[INFO] Apache CloudStack API ............................. SUCCESS [16.612s]
[INFO] Apache CloudStack Framework - REST ................ SUCCESS [4.079s]
[INFO] Apache CloudStack Framework - IPC ................. SUCCESS [7.182s]
[INFO] Apache CloudStack Cloud Engine .................... SUCCESS [0.410s]
[INFO] Apache CloudStack Cloud Engine API ................ SUCCESS [4.967s]
[INFO] Apache CloudStack Framework - Security ............ SUCCESS [2.701s]
[INFO] Apache CloudStack Core ............................ SUCCESS [29.929s]
[INFO] Apache CloudStack Agents .......................... SUCCESS [8.995s]
[INFO] Apache CloudStack Framework - Clustering .......... SUCCESS [6.226s]
[INFO] Apache CloudStack Framework - Event Notification .. SUCCESS [2.781s]
[INFO] Apache CloudStack Cloud Engine Schema Component ... SUCCESS [21.863s]
[INFO] Apache CloudStack Framework - Jobs ................ SUCCESS [6.005s]
[INFO] Apache CloudStack Cloud Engine Internal Components API  SUCCESS [3.375s]
[INFO] Apache CloudStack Server .......................... SUCCESS [50.349s]
[INFO] Apache CloudStack Usage Server .................... SUCCESS [10.805s]
[INFO] Apache CloudStack Cloud Engine Orchestration Component  SUCCESS [13.702s]
[INFO] Apache CloudStack Cloud Services .................. SUCCESS [0.407s]
[INFO] Apache CloudStack Secondary Storage ............... SUCCESS [4.095s]
[INFO] Apache CloudStack Secondary Storage Service ....... SUCCESS [11.888s]
[INFO] Apache CloudStack Engine Storage Component ........ SKIPPED
[INFO] Apache CloudStack Engine Storage Volume Component . SKIPPED
[INFO] Apache CloudStack Engine Storage Image Component .. SKIPPED
[INFO] Apache CloudStack Engine Storage Data Motion Component  SKIPPED
[INFO] Apache CloudStack Engine Storage Cache Component .. SKIPPED
[INFO] Apache CloudStack Engine Storage Snapshot Component  SKIPPED
[INFO] Apache CloudStack Cloud Engine API ................ SUCCESS [2.611s]
[INFO] Apache CloudStack Cloud Engine Service ............ SKIPPED
[INFO] Apache CloudStack Plugin POM ...................... SUCCESS [0.546s]
[INFO] Apache CloudStack Plugin - API Rate Limit ......... SUCCESS [22.283s]
[INFO] Apache CloudStack Plugin - Storage Volume default provider  SKIPPED
[INFO] Apache CloudStack Plugin - Storage Volume SolidFire Provider  SKIPPED
[INFO] Apache CloudStack Plugin - API SolidFire .......... SKIPPED
[INFO] Apache CloudStack Plugin - API Discovery .......... SUCCESS [22.245s]
[INFO] Apache CloudStack Plugin - ACL Static Role Based .. SUCCESS [5.691s]
[INFO] Apache CloudStack Plugin - Host Anti-Affinity Processor  SUCCESS [5.672s]
[INFO] Apache CloudStack Plugin - Explicit Dedication Processor  SUCCESS [5.663s]
[INFO] Apache CloudStack Plugin - User Concentrated Pod Deployment Planner  SUCCESS [4.630s]
[INFO] Apache CloudStack Plugin - User Dispersing Deployment Planner  SUCCESS [9.073s]
[INFO] Apache CloudStack Plugin - Implicit Dedication Planner  SUCCESS [25.213s]
[INFO] Apache CloudStack Plugin - Skip Heurestics Planner  SUCCESS [5.673s]
[INFO] Apache CloudStack Plugin - Host Allocator Random .. SUCCESS [7.213s]
[INFO] Apache CloudStack Plugin - Dedicated Resources .... SKIPPED
[INFO] Apache CloudStack Plugin - Hypervisor OracleVM .... SUCCESS [17.003s]
[INFO] Apache CloudStack Plugin - Open vSwitch ........... SUCCESS [22.394s]
[INFO] Apache CloudStack Plugin - Hypervisor XenServer ... SKIPPED
[INFO] Apache CloudStack Plugin - Hypervisor KVM ......... SKIPPED
[INFO] Apache CloudStack Plugin - RabbitMQ Event Bus ..... SUCCESS [14.966s]
[INFO] Apache CloudStack Plugin - In Memory Event Bus .... SUCCESS [22.180s]
[INFO] Apache CloudStack Plugin - Kafka Event Bus ........ SUCCESS [9.843s]
[INFO] Apache CloudStack Plugin - Hypervisor Baremetal ... SKIPPED
[INFO] Apache CloudStack Plugin - Hypervisor UCS ......... SUCCESS [8.874s]
[INFO] Apache CloudStack Plugin - Hypervisor Hyper-V ..... SKIPPED
[INFO] Apache CloudStack Plugin - Hypervisor OracleVM3 ... SKIPPED
[INFO] Apache CloudStack Plugin - Network Elastic Load Balancer  SKIPPED
[INFO] Apache CloudStack Plugin - Network Internal Load Balancer  SKIPPED
[INFO] Apache CloudStack Framework - Spring Life Cycle ... SUCCESS [2.693s]
[INFO] Apache CloudStack Plugin - Network Juniper Contrail  SKIPPED
[INFO] Apache CloudStack Plugin - Palo Alto .............. SKIPPED
[INFO] Apache CloudStack Plugin - Network Netscaler ...... SUCCESS [23.648s]
[INFO] Apache CloudStack Plugin - Network Nicira NVP ..... SKIPPED
[INFO] Apache CloudStack Plugin - BigSwitch Virtual Network Segment  SKIPPED
[INFO] Apache CloudStack Plugin - Network Brocade VCS .... SKIPPED
[INFO] Apache CloudStack Plugin - Midokura Midonet ....... SKIPPED
[INFO] Apache CloudStack Plugin - Stratosphere SSP ....... SKIPPED
[INFO] Apache CloudStack Plugin - Network Opendaylight ... SKIPPED
[INFO] Apache CloudStack Plugin - Storage Allocator Random  SKIPPED
[INFO] Apache CloudStack Plugin - User Authenticator LDAP  SUCCESS [23.212s]
[INFO] Apache CloudStack Plugin - User Authenticator MD5 . SKIPPED
[INFO] Apache CloudStack Plugin - User Authenticator PBKDF2-SHA-256  SKIPPED
[INFO] Apache CloudStack Plugin - User Authenticator Plain Text  SUCCESS [12.631s]
[INFO] Apache CloudStack Plugin - User Authenticator SAML2  SKIPPED
[INFO] Apache CloudStack Plugin - User Authenticator SHA256 Salted  SKIPPED
[INFO] Apache CloudStack Plugin - Dns Notifier Example ... SUCCESS [17.312s]
[INFO] Apache CloudStack Plugin - Storage Image S3 provider  SKIPPED
[INFO] Apache CloudStack Plugin - Storage Image Swift provider  SKIPPED
[INFO] Apache CloudStack Plugin - Storage Image default provider  SKIPPED
[INFO] Apache CloudStack Plugin - Storage Image sample provider  SKIPPED
[INFO] Apache CloudStack Plugin - Storage Volume Nexenta Provider  SKIPPED
[INFO] Apache CloudStack Plugin - Storage Volume CloudByte Provider  SKIPPED
[INFO] Apache CloudStack Plugin - Storage Volume sample provider  SKIPPED
[INFO] Apache CloudStack Plugin - SNMP Alerts ............ SKIPPED
[INFO] Apache CloudStack Plugin - Syslog Alerts .......... SKIPPED
[INFO] Apache CloudStack Plugin - Network VXLAN .......... SKIPPED
[INFO] Apache CloudStack Plugin - GloboDNS ............... SKIPPED
[INFO] Apache CloudStack Plugin - NetApp File System ..... SKIPPED
[INFO] Apache CloudStack Plugin - F5 ..................... SKIPPED
[INFO] Apache CloudStack Plugin - Juniper SRX ............ FAILURE [3.384s]
[INFO] Apache CloudStack Plugin - Nuage VSP .............. FAILURE [2.863s]
[INFO] Apache CloudStack VMware Base ..................... SUCCESS [11.134s]
[INFO] Apache CloudStack Plugin - Hypervisor VMware ...... SKIPPED
[INFO] Apache CloudStack Plugin - Cisco VNMC ............. SKIPPED
[INFO] Apache CloudStack Plugin - MySQL HA Strategy ...... SKIPPED
[INFO] Apache CloudStack Framework - Spring Module ....... SUCCESS [7.831s]
[INFO] Apache CloudStack Secondary Storage Controller .... SUCCESS [6.189s]
[INFO] Apache CloudStack Console Proxy - RDP Client ...... SUCCESS [11.830s]
[INFO] Apache CloudStack Console Proxy ................... SUCCESS [3.976s]
[INFO] Apache CloudStack Console Proxy - Server .......... SUCCESS [5.175s]
[INFO] Apache CloudStack System VM ....................... SKIPPED
[INFO] Apache CloudStack Client UI ....................... SKIPPED
[INFO] Apache CloudStack Framework - QuickCloud .......... SUCCESS [1.501s]
[INFO] ------------------------------------------------------------------------
[INFO] BUILD FAILURE
[INFO] ------------------------------------------------------------------------
[INFO] Total time: 3:03.029s (Wall Clock)
[INFO] Finished at: Mon Nov 23 10:41:29 UTC 2015
[INFO] Final Memory: 98M/1011M
[INFO] ------------------------------------------------------------------------
[INFO] 
[INFO] --- maven-surefire-plugin:2.18.1:test (default-test) @ cloud-plugin-user-authenticator-sha256salted
---
[WARNING] The requested profile "awsapi" could not be activated because it does not exist.
Running org.apache.cloudstack.network.opendaylight.api.test.NeutronNodeAdapterTest
[INFO] 
[INFO] --- maven-surefire-plugin:2.18.1:test (default-test) @ cloud-plugin-network-elb ---
Running org.apache.cloudstack.network.element.SspElementTest
[INFO] 
[INFO] --- maven-resources-plugin:2.5:testResources (default-testResources) @ cloud-plugin-snmp-alerts
---
[debug] execute contextualize
[INFO] 
[INFO] --- maven-surefire-plugin:2.18.1:test (default-test) @ cloud-plugin-network-internallb
---
log4j:WARN No appenders could be found for logger (org.springframework.test.context.junit4.SpringJUnit4ClassRunner).
log4j:WARN Please initialize the log4j system properly.
log4j:WARN See http://logging.apache.org/log4j/1.2/faq.html#noconfig for more info.
Running org.apache.cloudstack.dedicated.manager.DedicatedApiUnitTest
[INFO] 
[INFO] --- maven-resources-plugin:2.5:testResources (default-testResources) @ cloud-plugin-syslog-alerts
---
[debug] execute contextualize
[INFO] 
[INFO] --- maven-surefire-plugin:2.18.1:test (default-test) @ cloud-plugin-user-authenticator-md5
---
[INFO] Using 'UTF-8' encoding to copy filtered resources.
[INFO] skip non existing resourceDirectory <http://jenkins.buildacloud.org/job/build-master-noredist/ws/plugins/alert-handlers/snmp-alerts/test/resources>
[INFO] Copying 3 resources
[INFO] 
[INFO] --- maven-compiler-plugin:3.2:testCompile (default-testCompile) @ cloud-plugin-snmp-alerts
---
[INFO] 
[INFO] --- maven-resources-plugin:2.5:testResources (default-testResources) @ cloud-plugin-hypervisor-ovm3
---
[debug] execute contextualize
[INFO] Using 'UTF-8' encoding to copy filtered resources.
[INFO] Copying 10 resources
[INFO] Surefire report directory: <http://jenkins.buildacloud.org/job/build-master-noredist/ws/plugins/user-authenticators/sha256salted/target/surefire-reports>
[INFO] Surefire report directory: <http://jenkins.buildacloud.org/job/build-master-noredist/ws/plugins/user-authenticators/md5/target/surefire-reports>

-------------------------------------------------------
 T E S T S
-------------------------------------------------------
Tests run: 3, Failures: 0, Errors: 0, Skipped: 0, Time elapsed: 0 sec - in org.apache.cloudstack.network.opendaylight.api.test.NeutronNodeAdapterTest
[INFO] Building jar: <http://jenkins.buildacloud.org/job/build-master-noredist/ws/plugins/hypervisors/baremetal/target/cloud-plugin-hypervisor-baremetal-4.7.0-SNAPSHOT.jar>
[INFO] 
[INFO] --- license-maven-plugin:2.7:check (cloudstack-checklicence) @ cloud-plugin-network-nvp
---
[INFO] Checking licenses...
[INFO] Surefire report directory: <http://jenkins.buildacloud.org/job/build-master-noredist/ws/plugins/network-elements/internal-loadbalancer/target/surefire-reports>
[INFO] Changes detected - recompiling the module!
[INFO] Surefire report directory: <http://jenkins.buildacloud.org/job/build-master-noredist/ws/plugins/network-elements/elastic-loadbalancer/target/surefire-reports>
[INFO] Using 'UTF-8' encoding to copy filtered resources.
[INFO] skip non existing resourceDirectory <http://jenkins.buildacloud.org/job/build-master-noredist/ws/plugins/alert-handlers/syslog-alerts/test/resources>
[INFO] Copying 3 resources
[INFO] Compiling 2 source files to <http://jenkins.buildacloud.org/job/build-master-noredist/ws/plugins/alert-handlers/snmp-alerts/target/test-classes>
[INFO] 
[INFO] --- maven-compiler-plugin:3.2:testCompile (default-testCompile) @ cloud-plugin-syslog-alerts
---

-------------------------------------------------------
 T E S T S
-------------------------------------------------------

-------------------------------------------------------
 T E S T S
-------------------------------------------------------
Running org.apache.cloudstack.network.opendaylight.api.test.NeutronRestApiTest
log4j:WARN No appenders could be found for logger (org.apache.commons.httpclient.params.DefaultHttpParams).
log4j:WARN Please initialize the log4j system properly.
log4j:WARN See http://logging.apache.org/log4j/1.2/faq.html#noconfig for more info.
Tests run: 12, Failures: 0, Errors: 0, Skipped: 0, Time elapsed: 0.001 sec - in org.apache.cloudstack.network.opendaylight.api.test.NeutronRestApiTest
Running org.apache.cloudstack.network.opendaylight.api.test.NeutronEnumsTest
Tests run: 5, Failures: 0, Errors: 0, Skipped: 0, Time elapsed: 0.001 sec - in org.apache.cloudstack.network.opendaylight.api.test.NeutronEnumsTest
Running org.apache.cloudstack.network.opendaylight.api.test.NeutronPortAdapterTest

[ERROR] Failed to execute goal org.apache.maven.plugins:maven-checkstyle-plugin:2.11:check
(cloudstack-checkstyle) on project cloud-plugin-network-srx: Failed during checkstyle execution:
There are 1 checkstyle errors. -> [Help 1]
-------------------------------------------------------
 T E S T S
-------------------------------------------------------
Tests run: 2, Failures: 0, Errors: 0, Skipped: 0, Time elapsed: 0.009 sec - in org.apache.cloudstack.network.opendaylight.api.test.NeutronPortAdapterTest
Running org.apache.cloudstack.network.opendaylight.api.test.NeutronNetworkAdapterTest
[INFO] Changes detected - recompiling the module!
Tests run: 2, Failures: 0, Errors: 0, Skipped: 0, Time elapsed: 0 sec - in org.apache.cloudstack.network.opendaylight.api.test.NeutronNetworkAdapterTest

Results :

Tests run: 24, Failures: 0, Errors: 0, Skipped: 0

[INFO] 
[INFO] --- maven-jar-plugin:2.5:jar (default-jar) @ cloud-plugin-network-opendaylight ---
[ERROR] Failed to execute goal org.apache.maven.plugins:maven-checkstyle-plugin:2.11:check
(cloudstack-checkstyle) on project cloud-plugin-network-vsp: Failed during checkstyle execution:
There are 1 checkstyle errors. -> [Help 1]
[ERROR] 
[ERROR] To see the full stack trace of the errors, re-run Maven with the -e switch.
[ERROR] Re-run Maven using the -X switch to enable full debug logging.
[ERROR] 
[ERROR] For more information about the errors and possible solutions, please read the following
articles:
[ERROR] [Help 1] http://cwiki.apache.org/confluence/display/MAVEN/MojoExecutionException
[ERROR] 
[ERROR] After correcting the problems, you can resume the build with the command
[ERROR]   mvn <goals> -rf :cloud-plugin-network-srx
[INFO] Compiling 1 source file to <http://jenkins.buildacloud.org/job/build-master-noredist/ws/plugins/alert-handlers/syslog-alerts/target/test-classes>
[INFO] Copying 3 resources
[INFO] 
[INFO] --- maven-compiler-plugin:3.2:testCompile (default-testCompile) @ cloud-plugin-hypervisor-ovm3
---
[INFO] Building jar: <http://jenkins.buildacloud.org/job/build-master-noredist/ws/plugins/network-elements/opendaylight/target/cloud-plugin-network-opendaylight-4.7.0-SNAPSHOT.jar>
log4j:WARN No appenders could be found for logger (org.apache.cloudstack.network.element.SspElement).
log4j:WARN Please initialize the log4j system properly.
log4j:WARN See http://logging.apache.org/log4j/1.2/faq.html#noconfig for more info.
Tests run: 2, Failures: 0, Errors: 0, Skipped: 0, Time elapsed: 0.317 sec - in org.apache.cloudstack.network.element.SspElementTest
Running org.apache.cloudstack.network.element.SspClientTest
[INFO] 
[INFO] --- maven-resources-plugin:2.5:testResources (default-testResources) @ cloud-plugin-network-vxlan
---
[INFO] 
[INFO] --- maven-surefire-plugin:2.18.1:test (default-test) @ cloud-plugin-network-palo-alto
---
[INFO] 
[INFO] --- maven-site-plugin:3.1:attach-descriptor (attach-descriptor) @ cloud-plugin-hypervisor-baremetal
---
[INFO] 
[INFO] --- maven-surefire-plugin:2.18.1:test (default-test) @ cloud-plugin-user-authenticator-pbkdf2
---
Destroying 6 processes
[INFO] 
[INFO] --- maven-resources-plugin:2.5:testResources (default-testResources) @ cloud-plugin-network-nvp
---
Destroying process..
Destroying process..
Destroying process..
Destroying process..
Destroying process..
Destroying process..
Destroyed 6 processes
Build step 'Invoke top-level Maven targets' marked build as failure
Archiving artifacts

Mime
View raw message