cloudstack-dev mailing list archives

Site index · List index
Message view « Date » · « Thread »
Top « Date » · « Thread »
From jenk...@cloudstack.org
Subject Build failed in Jenkins: build-master-slowbuild #2703
Date Tue, 24 Nov 2015 00:07:13 GMT
See <http://jenkins.buildacloud.org/job/build-master-slowbuild/2703/>

------------------------------------------
[...truncated 25566 lines...]
[INFO] Done FindBugs Analysis....
[INFO] 
[INFO] <<< findbugs-maven-plugin:3.0.1:check (cloudstack-findbugs) @ cloud-plugin-network-f5
<<<
[INFO] 
[INFO] --- findbugs-maven-plugin:3.0.1:check (cloudstack-findbugs) @ cloud-plugin-network-f5
---
[INFO] BugInstance size is 0
[INFO] Error size is 0
[INFO] No errors/warnings found
[INFO] 
[INFO] --- maven-resources-plugin:2.5:testResources (default-testResources) @ cloud-plugin-network-f5
---
[debug] execute contextualize
[INFO] Using 'UTF-8' encoding to copy filtered resources.
[INFO] skip non existing resourceDirectory <http://jenkins.buildacloud.org/job/build-master-slowbuild/ws/plugins/network-elements/f5/test/resources>
[INFO] Copying 3 resources
[INFO] 
[INFO] --- maven-compiler-plugin:3.2:testCompile (default-testCompile) @ cloud-plugin-network-f5
---
[INFO] No sources to compile
[INFO] 
[INFO] --- maven-surefire-plugin:2.18.1:test (default-test) @ cloud-plugin-network-f5 ---
[INFO] 
[INFO] --- maven-jar-plugin:2.5:jar (default-jar) @ cloud-plugin-network-f5 ---
[INFO] Building jar: <http://jenkins.buildacloud.org/job/build-master-slowbuild/ws/plugins/network-elements/f5/target/cloud-plugin-network-f5-4.7.0-SNAPSHOT.jar>
[INFO] 
[INFO] --- maven-site-plugin:3.1:attach-descriptor (attach-descriptor) @ cloud-plugin-network-f5
---
[INFO] 
[INFO] --- maven-install-plugin:2.3.1:install (default-install) @ cloud-plugin-network-f5
---
[INFO] Installing <http://jenkins.buildacloud.org/job/build-master-slowbuild/ws/plugins/network-elements/f5/target/cloud-plugin-network-f5-4.7.0-SNAPSHOT.jar>
to /home/jenkins/.m2/repository/org/apache/cloudstack/cloud-plugin-network-f5/4.7.0-SNAPSHOT/cloud-plugin-network-f5-4.7.0-SNAPSHOT.jar
[INFO] Installing <http://jenkins.buildacloud.org/job/build-master-slowbuild/ws/plugins/network-elements/f5/pom.xml>
to /home/jenkins/.m2/repository/org/apache/cloudstack/cloud-plugin-network-f5/4.7.0-SNAPSHOT/cloud-plugin-network-f5-4.7.0-SNAPSHOT.pom
[INFO] 
[INFO] >>> cobertura-maven-plugin:2.6:cobertura (default-cli) @ cloud-plugin-network-f5
>>>
[INFO] 
[INFO] --- maven-checkstyle-plugin:2.11:check (cloudstack-checkstyle) @ cloud-plugin-network-f5
---
[INFO] Starting audit...
Audit done.

[INFO] 
[INFO] --- maven-remote-resources-plugin:1.3:process (default) @ cloud-plugin-network-f5 ---
[INFO] 
[INFO] --- maven-resources-plugin:2.5:resources (default-resources) @ cloud-plugin-network-f5
---
[debug] execute contextualize
[INFO] Using 'UTF-8' encoding to copy filtered resources.
[INFO] Copying 2 resources
[INFO] Copying 3 resources
[INFO] Copying 3 resources
[INFO] 
[INFO] --- maven-compiler-plugin:3.2:compile (default-compile) @ cloud-plugin-network-f5 ---
[INFO] Nothing to compile - all classes are up to date
[INFO] 
[INFO] >>> findbugs-maven-plugin:3.0.1:check (cloudstack-findbugs) @ cloud-plugin-network-f5
>>>
[INFO] 
[INFO] --- findbugs-maven-plugin:3.0.1:findbugs (findbugs) @ cloud-plugin-network-f5 ---
[INFO] Fork Value is true
     [java] The following classes needed for analysis were missing:
     [java]   javax.xml.rpc.Stub
     [java] Missing classes: 1
[INFO] Done FindBugs Analysis....
[INFO] 
[INFO] <<< findbugs-maven-plugin:3.0.1:check (cloudstack-findbugs) @ cloud-plugin-network-f5
<<<
[INFO] 
[INFO] --- findbugs-maven-plugin:3.0.1:check (cloudstack-findbugs) @ cloud-plugin-network-f5
---
[INFO] BugInstance size is 0
[INFO] Error size is 0
[INFO] No errors/warnings found
[INFO] 
[INFO] --- cobertura-maven-plugin:2.6:instrument (default-cli) @ cloud-plugin-network-f5 ---
[INFO] Cobertura 2.0.3 - GNU GPL License (NO WARRANTY) - See COPYRIGHT file

[ERROR] Nov 24, 2015 12:12:44 AM net.sourceforge.cobertura.coveragedata.CoverageDataFileHandler
saveCoverageData
INFO: Cobertura: Saved information on 14 classes.

[INFO] Instrumentation was successful.
[INFO] NOT adding cobertura ser file to attached artifacts list.
[INFO] 
[INFO] --- maven-resources-plugin:2.5:testResources (default-testResources) @ cloud-plugin-network-f5
---
[debug] execute contextualize
[INFO] Using 'UTF-8' encoding to copy filtered resources.
[INFO] skip non existing resourceDirectory <http://jenkins.buildacloud.org/job/build-master-slowbuild/ws/plugins/network-elements/f5/test/resources>
[INFO] Copying 3 resources
[INFO] Copying 3 resources
[INFO] 
[INFO] --- maven-compiler-plugin:3.2:testCompile (default-testCompile) @ cloud-plugin-network-f5
---
[INFO] No sources to compile
[INFO] 
[INFO] --- maven-surefire-plugin:2.18.1:test (default-test) @ cloud-plugin-network-f5 ---
[INFO] 
[INFO] <<< cobertura-maven-plugin:2.6:cobertura (default-cli) @ cloud-plugin-network-f5
<<<
[INFO] 
[INFO] --- cobertura-maven-plugin:2.6:cobertura (default-cli) @ cloud-plugin-network-f5 ---
[INFO] Cobertura 2.0.3 - GNU GPL License (NO WARRANTY) - See COPYRIGHT file
[cobertura] INFO  [main] net.sourceforge.cobertura.reporting.html.HTMLReport - Data file does
not contain instrumentation information for the file com/cloud/network/element/F5ExternalLoadBalancerElementService.java.
 Ensure this class was instrumented, and this data file contains the instrumentation information.
Report time: 582ms

[ERROR] Nov 24, 2015 12:12:44 AM net.sourceforge.cobertura.coveragedata.CoverageDataFileHandler
loadCoverageData
INFO: Cobertura: Loaded information on 14 classes.

[INFO] Cobertura Report generation was successful.
[INFO] Cobertura 2.0.3 - GNU GPL License (NO WARRANTY) - See COPYRIGHT file
Report time: 577ms

[ERROR] Nov 24, 2015 12:12:45 AM net.sourceforge.cobertura.coveragedata.CoverageDataFileHandler
loadCoverageData
INFO: Cobertura: Loaded information on 14 classes.

[INFO] Cobertura Report generation was successful.
[INFO]                                                                         
[INFO] ------------------------------------------------------------------------
[INFO] Building Apache CloudStack Plugin - Juniper SRX 4.7.0-SNAPSHOT
[INFO] ------------------------------------------------------------------------
[WARNING] The POM for org.eclipse.m2e:lifecycle-mapping:jar:1.0.0 is missing, no dependency
information available
[WARNING] Failed to retrieve plugin descriptor for org.eclipse.m2e:lifecycle-mapping:1.0.0:
Plugin org.eclipse.m2e:lifecycle-mapping:1.0.0 or one of its dependencies could not be resolved:
Failed to read artifact descriptor for org.eclipse.m2e:lifecycle-mapping:jar:1.0.0
[INFO] 
[INFO] --- maven-clean-plugin:2.5:clean (default-clean) @ cloud-plugin-network-srx ---
[INFO] Deleting <http://jenkins.buildacloud.org/job/build-master-slowbuild/ws/plugins/network-elements/juniper-srx/target>
(includes = [**/*], excludes = [])
[INFO] Deleting <http://jenkins.buildacloud.org/job/build-master-slowbuild/ws/plugins/network-elements/juniper-srx>
(includes = [target, dist], excludes = [])
[INFO] 
[INFO] --- maven-checkstyle-plugin:2.11:check (cloudstack-checkstyle) @ cloud-plugin-network-srx
---
[INFO] Starting audit...
<http://jenkins.buildacloud.org/job/build-master-slowbuild/ws/plugins/network-elements/juniper-srx/src/com/cloud/network/element/JuniperSRXExternalFirewallElement.java>:91:5:
Got an exception - expecting EOF, found 'RemoteAccessVPNServiceProvider'
Audit done.

[INFO] ------------------------------------------------------------------------
[INFO] Reactor Summary:
[INFO] 
[INFO] Apache CloudStack Developer Tools - Checkstyle Configuration  SUCCESS [1.710s]
[INFO] Apache CloudStack ................................. SUCCESS [2.119s]
[INFO] Apache CloudStack Maven Conventions Parent ........ SUCCESS [0.926s]
[INFO] Apache CloudStack Framework - Managed Context ..... SUCCESS [19.956s]
[INFO] Apache CloudStack Utils ........................... SUCCESS [1:31.066s]
[INFO] Apache CloudStack Framework ....................... SUCCESS [0.107s]
[INFO] Apache CloudStack Framework - Event Notification .. SUCCESS [53.957s]
[INFO] Apache CloudStack Framework - Configuration ....... SUCCESS [27.824s]
[INFO] Apache CloudStack API ............................. SUCCESS [1:51.044s]
[INFO] Apache CloudStack Framework - REST ................ SUCCESS [15.555s]
[INFO] Apache CloudStack Framework - IPC ................. SUCCESS [30.315s]
[INFO] Apache CloudStack Cloud Engine .................... SUCCESS [0.088s]
[INFO] Apache CloudStack Cloud Engine API ................ SUCCESS [29.360s]
[INFO] Apache CloudStack Framework - Security ............ SUCCESS [25.683s]
[INFO] Apache CloudStack Core ............................ SUCCESS [1:21.727s]
[INFO] Apache CloudStack Agents .......................... SUCCESS [36.644s]
[INFO] Apache CloudStack Framework - Clustering .......... SUCCESS [36.285s]
[INFO] Apache CloudStack Framework - Event Notification .. SUCCESS [14.422s]
[INFO] Apache CloudStack Cloud Engine Schema Component ... SUCCESS [2:09.136s]
[INFO] Apache CloudStack Framework - Jobs ................ SUCCESS [48.892s]
[INFO] Apache CloudStack Cloud Engine Internal Components API  SUCCESS [30.358s]
[INFO] Apache CloudStack Server .......................... SUCCESS [4:25.166s]
[INFO] Apache CloudStack Usage Server .................... SUCCESS [53.110s]
[INFO] Apache CloudStack Cloud Engine Orchestration Component  SUCCESS [1:28.350s]
[INFO] Apache CloudStack Cloud Services .................. SUCCESS [0.068s]
[INFO] Apache CloudStack Secondary Storage ............... SUCCESS [0.426s]
[INFO] Apache CloudStack Secondary Storage Service ....... SUCCESS [1:00.100s]
[INFO] Apache CloudStack Engine Storage Component ........ SUCCESS [59.872s]
[INFO] Apache CloudStack Engine Storage Volume Component . SUCCESS [31.306s]
[INFO] Apache CloudStack Engine Storage Image Component .. SUCCESS [29.384s]
[INFO] Apache CloudStack Engine Storage Data Motion Component  SUCCESS [27.742s]
[INFO] Apache CloudStack Engine Storage Cache Component .. SUCCESS [21.624s]
[INFO] Apache CloudStack Engine Storage Snapshot Component  SUCCESS [36.751s]
[INFO] Apache CloudStack Cloud Engine API ................ SUCCESS [13.433s]
[INFO] Apache CloudStack Cloud Engine Service ............ SUCCESS [7.622s]
[INFO] Apache CloudStack Plugin POM ...................... SUCCESS [0.958s]
[INFO] Apache CloudStack Plugin - API Rate Limit ......... SUCCESS [1:39.256s]
[INFO] Apache CloudStack Plugin - Storage Volume default provider  SUCCESS [3:23.451s]
[INFO] Apache CloudStack Plugin - Storage Volume SolidFire Provider  SUCCESS [1:20.623s]
[INFO] Apache CloudStack Plugin - API SolidFire .......... SUCCESS [21.719s]
[INFO] Apache CloudStack Plugin - API Discovery .......... SUCCESS [42.603s]
[INFO] Apache CloudStack Plugin - ACL Static Role Based .. SUCCESS [27.161s]
[INFO] Apache CloudStack Plugin - Host Anti-Affinity Processor  SUCCESS [41.199s]
[INFO] Apache CloudStack Plugin - Explicit Dedication Processor  SUCCESS [38.028s]
[INFO] Apache CloudStack Plugin - User Concentrated Pod Deployment Planner  SUCCESS [21.088s]
[INFO] Apache CloudStack Plugin - User Dispersing Deployment Planner  SUCCESS [19.957s]
[INFO] Apache CloudStack Plugin - Implicit Dedication Planner  SUCCESS [27.973s]
[INFO] Apache CloudStack Plugin - Skip Heurestics Planner  SUCCESS [15.391s]
[INFO] Apache CloudStack Plugin - Host Allocator Random .. SUCCESS [18.128s]
[INFO] Apache CloudStack Plugin - Dedicated Resources .... SUCCESS [33.716s]
[INFO] Apache CloudStack Plugin - Hypervisor OracleVM .... SUCCESS [34.438s]
[INFO] Apache CloudStack Plugin - Open vSwitch ........... SUCCESS [35.483s]
[INFO] Apache CloudStack Plugin - Hypervisor XenServer ... SUCCESS [1:18.182s]
[INFO] Apache CloudStack Plugin - Hypervisor KVM ......... SUCCESS [1:14.140s]
[INFO] Apache CloudStack Plugin - RabbitMQ Event Bus ..... SUCCESS [20.858s]
[INFO] Apache CloudStack Plugin - In Memory Event Bus .... SUCCESS [20.456s]
[INFO] Apache CloudStack Plugin - Kafka Event Bus ........ SUCCESS [15.132s]
[INFO] Apache CloudStack Plugin - Hypervisor Baremetal ... SUCCESS [42.906s]
[INFO] Apache CloudStack Plugin - Hypervisor UCS ......... SUCCESS [26.950s]
[INFO] Apache CloudStack Plugin - Hypervisor Hyper-V ..... SUCCESS [40.476s]
[INFO] Apache CloudStack Plugin - Hypervisor OracleVM3 ... SUCCESS [1:23.807s]
[INFO] Apache CloudStack Plugin - Network Elastic Load Balancer  SUCCESS [33.397s]
[INFO] Apache CloudStack Plugin - Network Internal Load Balancer  SUCCESS [37.124s]
[INFO] Apache CloudStack Framework - Spring Life Cycle ... SUCCESS [19.479s]
[INFO] Apache CloudStack Plugin - Network Juniper Contrail  SUCCESS [1:02.161s]
[INFO] Apache CloudStack Plugin - Palo Alto .............. SUCCESS [41.235s]
[INFO] Apache CloudStack Plugin - Network Netscaler ...... SUCCESS [51.653s]
[INFO] Apache CloudStack Plugin - Network Nicira NVP ..... SUCCESS [52.299s]
[INFO] Apache CloudStack Plugin - BigSwitch Virtual Network Segment  SUCCESS [45.090s]
[INFO] Apache CloudStack Plugin - Network Brocade VCS .... SUCCESS [41.226s]
[INFO] Apache CloudStack Plugin - Midokura Midonet ....... SUCCESS [35.294s]
[INFO] Apache CloudStack Plugin - Stratosphere SSP ....... SUCCESS [32.219s]
[INFO] Apache CloudStack Plugin - Network Opendaylight ... SUCCESS [37.252s]
[INFO] Apache CloudStack Plugin - Storage Allocator Random  SUCCESS [16.521s]
[INFO] Apache CloudStack Plugin - User Authenticator LDAP  SUCCESS [31.262s]
[INFO] Apache CloudStack Plugin - User Authenticator MD5 . SUCCESS [21.134s]
[INFO] Apache CloudStack Plugin - User Authenticator PBKDF2-SHA-256  SUCCESS [24.820s]
[INFO] Apache CloudStack Plugin - User Authenticator Plain Text  SUCCESS [17.555s]
[INFO] Apache CloudStack Plugin - User Authenticator SAML2  SUCCESS [1:52.060s]
[INFO] Apache CloudStack Plugin - User Authenticator SHA256 Salted  SUCCESS [22.433s]
[INFO] Apache CloudStack Plugin - Dns Notifier Example ... SUCCESS [13.834s]
[INFO] Apache CloudStack Plugin - Storage Image S3 provider  SUCCESS [19.436s]
[INFO] Apache CloudStack Plugin - Storage Image Swift provider  SUCCESS [16.779s]
[INFO] Apache CloudStack Plugin - Storage Image default provider  SUCCESS [19.786s]
[INFO] Apache CloudStack Plugin - Storage Image sample provider  SUCCESS [16.576s]
[INFO] Apache CloudStack Plugin - Storage Volume Nexenta Provider  SUCCESS [25.500s]
[INFO] Apache CloudStack Plugin - Storage Volume CloudByte Provider  SUCCESS [36.063s]
[INFO] Apache CloudStack Plugin - Storage Volume sample provider  SUCCESS [16.892s]
[INFO] Apache CloudStack Plugin - SNMP Alerts ............ SUCCESS [23.529s]
[INFO] Apache CloudStack Plugin - Syslog Alerts .......... SUCCESS [24.404s]
[INFO] Apache CloudStack Plugin - Network VXLAN .......... SUCCESS [23.133s]
[INFO] Apache CloudStack Plugin - GloboDNS ............... SUCCESS [31.972s]
[INFO] Apache CloudStack Plugin - NetApp File System ..... SUCCESS [29.769s]
[INFO] Apache CloudStack Plugin - F5 ..................... SUCCESS [31.142s]
[INFO] Apache CloudStack Plugin - Juniper SRX ............ FAILURE [0.220s]
[INFO] Apache CloudStack Plugin - Nuage VSP .............. SKIPPED
[INFO] Apache CloudStack VMware Base ..................... SKIPPED
[INFO] Apache CloudStack Plugin - Hypervisor VMware ...... SKIPPED
[INFO] Apache CloudStack Plugin - Cisco VNMC ............. SKIPPED
[INFO] Apache CloudStack Plugin - MySQL HA Strategy ...... SKIPPED
[INFO] Apache CloudStack Framework - Spring Module ....... SKIPPED
[INFO] Apache CloudStack Secondary Storage Controller .... SKIPPED
[INFO] Apache CloudStack Client UI ....................... SKIPPED
[INFO] Apache CloudStack Console Proxy - RDP Client ...... SKIPPED
[INFO] Apache CloudStack Console Proxy ................... SKIPPED
[INFO] Apache CloudStack Console Proxy - Server .......... SKIPPED
[INFO] Apache CloudStack Framework - QuickCloud .......... SKIPPED
[INFO] ------------------------------------------------------------------------
[INFO] BUILD FAILURE
[INFO] ------------------------------------------------------------------------
[INFO] Total time: 1:01:51.974s
[INFO] Finished at: Tue Nov 24 00:12:46 UTC 2015
[INFO] Final Memory: 169M/438M
[INFO] ------------------------------------------------------------------------
[ERROR] Failed to execute goal org.apache.maven.plugins:maven-checkstyle-plugin:2.11:check
(cloudstack-checkstyle) on project cloud-plugin-network-srx: Failed during checkstyle execution:
There are 1 checkstyle errors. -> [Help 1]
[ERROR] 
[ERROR] To see the full stack trace of the errors, re-run Maven with the -e switch.
[ERROR] Re-run Maven using the -X switch to enable full debug logging.
[ERROR] 
[ERROR] For more information about the errors and possible solutions, please read the following
articles:
[ERROR] [Help 1] http://cwiki.apache.org/confluence/display/MAVEN/MojoExecutionException
[ERROR] 
[ERROR] After correcting the problems, you can resume the build with the command
[ERROR]   mvn <goals> -rf :cloud-plugin-network-srx
Build step 'Invoke top-level Maven targets' marked build as failure
[FINDBUGS] Skipping publisher since build result is FAILURE
Skipping Cobertura coverage report as build was not UNSTABLE or better ...

Mime
View raw message