cloudstack-dev mailing list archives

Site index · List index
Message view « Date » · « Thread »
Top « Date » · « Thread »
From jenk...@cloudstack.org
Subject Build failed in Jenkins: build-master-jdk18 #352
Date Tue, 15 Sep 2015 12:24:46 GMT
See <http://jenkins.buildacloud.org/job/build-master-jdk18/352/changes>

Changes:

[Boris Schrijver] Replaced all occurences of Charset.forName(UTF-8) with StringUtils.getPreferredCharset().

------------------------------------------
[...truncated 5515 lines...]
[INFO] Apache CloudStack Plugin - Hypervisor KVM ......... SUCCESS [32.546s]
[INFO] Apache CloudStack Plugin - RabbitMQ Event Bus ..... SUCCESS [5.785s]
[INFO] Apache CloudStack Plugin - In Memory Event Bus .... SUCCESS [10.916s]
[INFO] Apache CloudStack Plugin - Kafka Event Bus ........ SUCCESS [4.732s]
[INFO] Apache CloudStack Plugin - Hypervisor Baremetal ... SUCCESS [12.502s]
[INFO] Apache CloudStack Plugin - Hypervisor UCS ......... SUCCESS [6.668s]
[INFO] Apache CloudStack Plugin - Hypervisor Hyper-V ..... SUCCESS [15.495s]
[INFO] Apache CloudStack Plugin - Hypervisor OracleVM3 ... SUCCESS [43.535s]
[INFO] Apache CloudStack Plugin - Network Elastic Load Balancer  SUCCESS [14.243s]
[INFO] Apache CloudStack Plugin - Network Internal Load Balancer  SUCCESS [22.559s]
[INFO] Apache CloudStack Framework - Spring Life Cycle ... SUCCESS [4.786s]
[INFO] Apache CloudStack Plugin - Network Juniper Contrail  SUCCESS [35.560s]
[INFO] Apache CloudStack Plugin - Palo Alto .............. SUCCESS [19.304s]
[INFO] Apache CloudStack Plugin - Network Netscaler ...... SUCCESS [11.396s]
[INFO] Apache CloudStack Plugin - Network Nicira NVP ..... SUCCESS [32.444s]
[INFO] Apache CloudStack Plugin - BigSwitch Virtual Network Segment  SUCCESS [21.689s]
[INFO] Apache CloudStack Plugin - Network Brocade VCS .... FAILURE [12.401s]
[INFO] Apache CloudStack Plugin - Midokura Midonet ....... SKIPPED
[INFO] Apache CloudStack Plugin - Stratosphere SSP ....... SKIPPED
[INFO] Apache CloudStack Plugin - Network Opendaylight ... SKIPPED
[INFO] Apache CloudStack Plugin - Storage Allocator Random  SKIPPED
[INFO] Apache CloudStack Plugin - User Authenticator LDAP  SKIPPED
[INFO] Apache CloudStack Plugin - User Authenticator MD5 . SKIPPED
[INFO] Apache CloudStack Plugin - User Authenticator PBKDF2-SHA-256  SKIPPED
[INFO] Apache CloudStack Plugin - User Authenticator Plain Text  SKIPPED
[INFO] Apache CloudStack Plugin - User Authenticator SAML2  SKIPPED
[INFO] Apache CloudStack Plugin - User Authenticator SHA256 Salted  SKIPPED
[INFO] Apache CloudStack Plugin - Dns Notifier Example ... SKIPPED
[INFO] Apache CloudStack Plugin - Storage Image S3 ....... SKIPPED
[INFO] Apache CloudStack Plugin - Storage Image Swift provider  SKIPPED
[INFO] Apache CloudStack Plugin - Storage Image default provider  SKIPPED
[INFO] Apache CloudStack Plugin - Storage Image sample provider  SKIPPED
[INFO] Apache CloudStack Plugin - Storage Volume Nexenta Provider  SKIPPED
[INFO] Apache CloudStack Plugin - Storage Volume CloudByte Provider  SKIPPED
[INFO] Apache CloudStack Plugin - Storage Volume sample provider  SKIPPED
[INFO] Apache CloudStack Plugin - SNMP Alerts ............ SKIPPED
[INFO] Apache CloudStack Plugin - Syslog Alerts .......... SKIPPED
[INFO] Apache CloudStack Plugin - Network VXLAN .......... SKIPPED
[INFO] Apache CloudStack Plugin - GloboDNS ............... SKIPPED
[INFO] Apache CloudStack Framework - Spring Module ....... SKIPPED
[INFO] Apache CloudStack Secondary Storage Controller .... SKIPPED
[INFO] Apache CloudStack Console Proxy - RDP Client ...... SKIPPED
[INFO] Apache CloudStack Console Proxy ................... SKIPPED
[INFO] Apache CloudStack Console Proxy - Server .......... SKIPPED
[INFO] Apache CloudStack System VM ....................... SKIPPED
[INFO] Apache CloudStack Client UI ....................... SKIPPED
[INFO] Apache CloudStack Framework - QuickCloud .......... SKIPPED
[INFO] ------------------------------------------------------------------------
[INFO] BUILD FAILURE
[INFO] ------------------------------------------------------------------------
[INFO] Total time: 17:43.659s
[INFO] Finished at: Tue Sep 15 12:30:09 UTC 2015
[INFO] Final Memory: 66M/210M
[INFO] ------------------------------------------------------------------------
[ERROR] Failed to execute goal org.apache.maven.plugins:maven-compiler-plugin:3.2:compile
(default-compile) on project cloud-plugin-network-vcs: Compilation failure: Compilation failure:
[ERROR] <http://jenkins.buildacloud.org/job/build-master-jdk18/ws/plugins/network-elements/brocade-vcs/src/com/cloud/network/brocade/BrocadeVcsApi.java>:[95,11]
error: cannot find symbol
[ERROR] symbol:   class Output
[ERROR] location: class BrocadeVcsApi
[ERROR] <http://jenkins.buildacloud.org/job/build-master-jdk18/ws/plugins/network-elements/brocade-vcs/src/com/cloud/network/brocade/BrocadeVcsApi.java>:[366,14]
error: cannot find symbol
[ERROR] symbol:   class Output
[ERROR] location: class BrocadeVcsApi
[ERROR] <http://jenkins.buildacloud.org/job/build-master-jdk18/ws/plugins/network-elements/brocade-vcs/src/com/cloud/network/brocade/BrocadeVcsApi.java>:[423,14]
error: cannot find symbol
[ERROR] symbol:   class Output
[ERROR] location: class BrocadeVcsApi
[ERROR] <http://jenkins.buildacloud.org/job/build-master-jdk18/ws/plugins/network-elements/brocade-vcs/src/com/cloud/network/brocade/BrocadeVcsApi.java>:[120,8]
error: cannot find symbol
[ERROR] symbol:   class PortProfileGlobal
[ERROR] location: class BrocadeVcsApi
[ERROR] <http://jenkins.buildacloud.org/job/build-master-jdk18/ws/plugins/network-elements/brocade-vcs/src/com/cloud/network/brocade/BrocadeVcsApi.java>:[120,50]
error: cannot find symbol
[ERROR] symbol:   class PortProfileGlobal
[ERROR] location: class BrocadeVcsApi
[ERROR] <http://jenkins.buildacloud.org/job/build-master-jdk18/ws/plugins/network-elements/brocade-vcs/src/com/cloud/network/brocade/BrocadeVcsApi.java>:[121,19]
error: cannot find symbol
[ERROR] symbol:   method setVlanProfile(<null>)
[ERROR] location: variable portProfile of type PortProfile
[ERROR] <http://jenkins.buildacloud.org/job/build-master-jdk18/ws/plugins/network-elements/brocade-vcs/src/com/cloud/network/brocade/BrocadeVcsApi.java>:[122,8]
error: cannot find symbol
[ERROR] symbol:   class Activate
[ERROR] location: class BrocadeVcsApi
[ERROR] <http://jenkins.buildacloud.org/job/build-master-jdk18/ws/plugins/network-elements/brocade-vcs/src/com/cloud/network/brocade/BrocadeVcsApi.java>:[122,32]
error: cannot find symbol
[ERROR] symbol:   class Activate
[ERROR] location: class BrocadeVcsApi
[ERROR] <http://jenkins.buildacloud.org/job/build-master-jdk18/ws/plugins/network-elements/brocade-vcs/src/com/cloud/network/brocade/BrocadeVcsApi.java>:[135,34]
error: PortProfile() is not public in PortProfile; cannot be accessed from outside package
[ERROR] <http://jenkins.buildacloud.org/job/build-master-jdk18/ws/plugins/network-elements/brocade-vcs/src/com/cloud/network/brocade/BrocadeVcsApi.java>:[136,19]
error: cannot find symbol
[ERROR] symbol:   method setName(String)
[ERROR] location: variable portProfile of type PortProfile
[ERROR] <http://jenkins.buildacloud.org/job/build-master-jdk18/ws/plugins/network-elements/brocade-vcs/src/com/cloud/network/brocade/BrocadeVcsApi.java>:[149,8]
error: cannot find symbol
[ERROR] symbol:   class VlanProfile
[ERROR] location: class BrocadeVcsApi
[ERROR] <http://jenkins.buildacloud.org/job/build-master-jdk18/ws/plugins/network-elements/brocade-vcs/src/com/cloud/network/brocade/BrocadeVcsApi.java>:[149,38]
error: cannot find symbol
[ERROR] symbol:   class VlanProfile
[ERROR] location: class BrocadeVcsApi
[ERROR] <http://jenkins.buildacloud.org/job/build-master-jdk18/ws/plugins/network-elements/brocade-vcs/src/com/cloud/network/brocade/BrocadeVcsApi.java>:[164,8]
error: cannot find symbol
[ERROR] symbol:   class SwitchportBasic
[ERROR] location: class BrocadeVcsApi
[ERROR] <http://jenkins.buildacloud.org/job/build-master-jdk18/ws/plugins/network-elements/brocade-vcs/src/com/cloud/network/brocade/BrocadeVcsApi.java>:[164,46]
error: cannot find symbol
[ERROR] symbol:   class SwitchportBasic
[ERROR] location: class BrocadeVcsApi
[ERROR] <http://jenkins.buildacloud.org/job/build-master-jdk18/ws/plugins/network-elements/brocade-vcs/src/com/cloud/network/brocade/BrocadeVcsApi.java>:[165,22]
error: Basic is abstract; cannot be instantiated
[ERROR] <http://jenkins.buildacloud.org/job/build-master-jdk18/ws/plugins/network-elements/brocade-vcs/src/com/cloud/network/brocade/BrocadeVcsApi.java>:[167,19]
error: cannot find symbol
[ERROR] symbol:   method getVlanProfile()
[ERROR] location: variable portProfile of type PortProfile
[ERROR] <http://jenkins.buildacloud.org/job/build-master-jdk18/ws/plugins/network-elements/brocade-vcs/src/com/cloud/network/brocade/BrocadeVcsApi.java>:[170,12]
error: cannot find symbol
[ERROR] symbol:   class VlanProfile
[ERROR] location: class BrocadeVcsApi
[ERROR] <http://jenkins.buildacloud.org/job/build-master-jdk18/ws/plugins/network-elements/brocade-vcs/src/com/cloud/network/brocade/BrocadeVcsApi.java>:[170,42]
error: cannot find symbol
[ERROR] symbol:   class VlanProfile
[ERROR] location: class BrocadeVcsApi
[ERROR] <http://jenkins.buildacloud.org/job/build-master-jdk18/ws/plugins/network-elements/brocade-vcs/src/com/cloud/network/brocade/BrocadeVcsApi.java>:[171,12]
error: cannot find symbol
[ERROR] symbol:   class Switchport
[ERROR] location: class BrocadeVcsApi
[ERROR] <http://jenkins.buildacloud.org/job/build-master-jdk18/ws/plugins/network-elements/brocade-vcs/src/com/cloud/network/brocade/BrocadeVcsApi.java>:[171,40]
error: cannot find symbol
[ERROR] symbol:   class Switchport
[ERROR] location: class BrocadeVcsApi
[ERROR] <http://jenkins.buildacloud.org/job/build-master-jdk18/ws/plugins/network-elements/brocade-vcs/src/com/cloud/network/brocade/BrocadeVcsApi.java>:[172,12]
error: cannot find symbol
[ERROR] symbol:   class Mode
[ERROR] location: class BrocadeVcsApi
[ERROR] <http://jenkins.buildacloud.org/job/build-master-jdk18/ws/plugins/network-elements/brocade-vcs/src/com/cloud/network/brocade/BrocadeVcsApi.java>:[172,28]
error: cannot find symbol
[ERROR] symbol:   class Mode
[ERROR] location: class BrocadeVcsApi
[ERROR] <http://jenkins.buildacloud.org/job/build-master-jdk18/ws/plugins/network-elements/brocade-vcs/src/com/cloud/network/brocade/BrocadeVcsApi.java>:[180,34]
error: cannot find symbol
[ERROR] symbol:   class VlanProfile
[ERROR] location: class BrocadeVcsApi
[ERROR] <http://jenkins.buildacloud.org/job/build-master-jdk18/ws/plugins/network-elements/brocade-vcs/src/com/cloud/network/brocade/BrocadeVcsApi.java>:[181,33]
error: cannot find symbol
[ERROR] symbol:   class Switchport
[ERROR] location: class BrocadeVcsApi
[ERROR] <http://jenkins.buildacloud.org/job/build-master-jdk18/ws/plugins/network-elements/brocade-vcs/src/com/cloud/network/brocade/BrocadeVcsApi.java>:[182,16]
error: cannot find symbol
[ERROR] symbol:   class Trunk
[ERROR] location: class BrocadeVcsApi
[ERROR] <http://jenkins.buildacloud.org/job/build-master-jdk18/ws/plugins/network-elements/brocade-vcs/src/com/cloud/network/brocade/BrocadeVcsApi.java>:[182,34]
error: cannot find symbol
[ERROR] symbol:   class Trunk
[ERROR] location: class BrocadeVcsApi
[ERROR] <http://jenkins.buildacloud.org/job/build-master-jdk18/ws/plugins/network-elements/brocade-vcs/src/com/cloud/network/brocade/BrocadeVcsApi.java>:[183,16]
error: cannot find symbol
[ERROR] symbol:   class Allowed
[ERROR] location: class BrocadeVcsApi
[ERROR] <http://jenkins.buildacloud.org/job/build-master-jdk18/ws/plugins/network-elements/brocade-vcs/src/com/cloud/network/brocade/BrocadeVcsApi.java>:[183,38]
error: cannot find symbol
[ERROR] symbol:   class Allowed
[ERROR] location: class BrocadeVcsApi
[ERROR] <http://jenkins.buildacloud.org/job/build-master-jdk18/ws/plugins/network-elements/brocade-vcs/src/com/cloud/network/brocade/BrocadeVcsApi.java>:[184,23]
error: package Allowed does not exist
[ERROR] <http://jenkins.buildacloud.org/job/build-master-jdk18/ws/plugins/network-elements/brocade-vcs/src/com/cloud/network/brocade/BrocadeVcsApi.java>:[184,54]
error: package Allowed does not exist
[ERROR] <http://jenkins.buildacloud.org/job/build-master-jdk18/ws/plugins/network-elements/brocade-vcs/src/com/cloud/network/brocade/BrocadeVcsApi.java>:[205,8]
error: cannot find symbol
[ERROR] symbol:   class InterfaceVlan
[ERROR] location: class BrocadeVcsApi
[ERROR] <http://jenkins.buildacloud.org/job/build-master-jdk18/ws/plugins/network-elements/brocade-vcs/src/com/cloud/network/brocade/BrocadeVcsApi.java>:[205,42]
error: cannot find symbol
[ERROR] symbol:   class InterfaceVlan
[ERROR] location: class BrocadeVcsApi
[ERROR] <http://jenkins.buildacloud.org/job/build-master-jdk18/ws/plugins/network-elements/brocade-vcs/src/com/cloud/network/brocade/BrocadeVcsApi.java>:[206,8]
error: cannot find symbol
[ERROR] symbol:   class Interface
[ERROR] location: class BrocadeVcsApi
[ERROR] <http://jenkins.buildacloud.org/job/build-master-jdk18/ws/plugins/network-elements/brocade-vcs/src/com/cloud/network/brocade/BrocadeVcsApi.java>:[206,37]
error: cannot find symbol
[ERROR] symbol:   class Interface
[ERROR] location: class BrocadeVcsApi
[ERROR] <http://jenkins.buildacloud.org/job/build-master-jdk18/ws/plugins/network-elements/brocade-vcs/src/com/cloud/network/brocade/BrocadeVcsApi.java>:[207,20]
error: Vlan is abstract; cannot be instantiated
[ERROR] <http://jenkins.buildacloud.org/job/build-master-jdk18/ws/plugins/network-elements/brocade-vcs/src/com/cloud/network/brocade/BrocadeVcsApi.java>:[208,12]
error: cannot find symbol
[ERROR] symbol:   method setName(int)
[ERROR] location: variable vlan of type Vlan
[ERROR] <http://jenkins.buildacloud.org/job/build-master-jdk18/ws/plugins/network-elements/brocade-vcs/src/com/cloud/network/brocade/BrocadeVcsApi.java>:[221,8]
error: cannot find symbol
[ERROR] symbol:   class PortProfileGlobal
[ERROR] location: class BrocadeVcsApi
[ERROR] <http://jenkins.buildacloud.org/job/build-master-jdk18/ws/plugins/network-elements/brocade-vcs/src/com/cloud/network/brocade/BrocadeVcsApi.java>:[221,50]
error: cannot find symbol
[ERROR] symbol:   class PortProfileGlobal
[ERROR] location: class BrocadeVcsApi
[ERROR] <http://jenkins.buildacloud.org/job/build-master-jdk18/ws/plugins/network-elements/brocade-vcs/src/com/cloud/network/brocade/BrocadeVcsApi.java>:[222,34]
error: PortProfile() is not public in PortProfile; cannot be accessed from outside package
[ERROR] <http://jenkins.buildacloud.org/job/build-master-jdk18/ws/plugins/network-elements/brocade-vcs/src/com/cloud/network/brocade/BrocadeVcsApi.java>:[223,19]
error: cannot find symbol
[ERROR] symbol:   method setName(String)
[ERROR] location: variable portProfile of type PortProfile
[ERROR] <http://jenkins.buildacloud.org/job/build-master-jdk18/ws/plugins/network-elements/brocade-vcs/src/com/cloud/network/brocade/BrocadeVcsApi.java>:[224,8]
error: cannot find symbol
[ERROR] symbol:   class Static
[ERROR] location: class BrocadeVcsApi
[ERROR] <http://jenkins.buildacloud.org/job/build-master-jdk18/ws/plugins/network-elements/brocade-vcs/src/com/cloud/network/brocade/BrocadeVcsApi.java>:[224,31]
error: cannot find symbol
[ERROR] symbol:   class Static
[ERROR] location: class BrocadeVcsApi
[ERROR] <http://jenkins.buildacloud.org/job/build-master-jdk18/ws/plugins/network-elements/brocade-vcs/src/com/cloud/network/brocade/BrocadeVcsApi.java>:[238,8]
error: cannot find symbol
[ERROR] symbol:   class PortProfileGlobal
[ERROR] location: class BrocadeVcsApi
[ERROR] <http://jenkins.buildacloud.org/job/build-master-jdk18/ws/plugins/network-elements/brocade-vcs/src/com/cloud/network/brocade/BrocadeVcsApi.java>:[238,50]
error: cannot find symbol
[ERROR] symbol:   class PortProfileGlobal
[ERROR] location: class BrocadeVcsApi
[ERROR] <http://jenkins.buildacloud.org/job/build-master-jdk18/ws/plugins/network-elements/brocade-vcs/src/com/cloud/network/brocade/BrocadeVcsApi.java>:[239,34]
error: PortProfile() is not public in PortProfile; cannot be accessed from outside package
[ERROR] <http://jenkins.buildacloud.org/job/build-master-jdk18/ws/plugins/network-elements/brocade-vcs/src/com/cloud/network/brocade/BrocadeVcsApi.java>:[240,19]
error: cannot find symbol
[ERROR] symbol:   method setName(String)
[ERROR] location: variable portProfile of type PortProfile
[ERROR] <http://jenkins.buildacloud.org/job/build-master-jdk18/ws/plugins/network-elements/brocade-vcs/src/com/cloud/network/brocade/BrocadeVcsApi.java>:[241,8]
error: cannot find symbol
[ERROR] symbol:   class Static
[ERROR] location: class BrocadeVcsApi
[ERROR] <http://jenkins.buildacloud.org/job/build-master-jdk18/ws/plugins/network-elements/brocade-vcs/src/com/cloud/network/brocade/BrocadeVcsApi.java>:[241,31]
error: cannot find symbol
[ERROR] symbol:   class Static
[ERROR] location: class BrocadeVcsApi
[ERROR] <http://jenkins.buildacloud.org/job/build-master-jdk18/ws/plugins/network-elements/brocade-vcs/src/com/cloud/network/brocade/BrocadeVcsApi.java>:[269,8]
error: cannot find symbol
[ERROR] symbol:   class InterfaceVlan
[ERROR] location: class BrocadeVcsApi
[ERROR] <http://jenkins.buildacloud.org/job/build-master-jdk18/ws/plugins/network-elements/brocade-vcs/src/com/cloud/network/brocade/BrocadeVcsApi.java>:[269,42]
error: cannot find symbol
[ERROR] symbol:   class InterfaceVlan
[ERROR] location: class BrocadeVcsApi
[ERROR] <http://jenkins.buildacloud.org/job/build-master-jdk18/ws/plugins/network-elements/brocade-vcs/src/com/cloud/network/brocade/BrocadeVcsApi.java>:[270,8]
error: cannot find symbol
[ERROR] symbol:   class Interface
[ERROR] location: class BrocadeVcsApi
[ERROR] <http://jenkins.buildacloud.org/job/build-master-jdk18/ws/plugins/network-elements/brocade-vcs/src/com/cloud/network/brocade/BrocadeVcsApi.java>:[270,37]
error: cannot find symbol
[ERROR] symbol:   class Interface
[ERROR] location: class BrocadeVcsApi
[ERROR] <http://jenkins.buildacloud.org/job/build-master-jdk18/ws/plugins/network-elements/brocade-vcs/src/com/cloud/network/brocade/BrocadeVcsApi.java>:[271,20]
error: Vlan is abstract; cannot be instantiated
[ERROR] <http://jenkins.buildacloud.org/job/build-master-jdk18/ws/plugins/network-elements/brocade-vcs/src/com/cloud/network/brocade/BrocadeVcsApi.java>:[272,12]
error: cannot find symbol
[ERROR] symbol:   method setOperation(String)
[ERROR] location: variable vlan of type Vlan
[ERROR] <http://jenkins.buildacloud.org/job/build-master-jdk18/ws/plugins/network-elements/brocade-vcs/src/com/cloud/network/brocade/BrocadeVcsApi.java>:[273,12]
error: cannot find symbol
[ERROR] symbol:   method setName(int)
[ERROR] location: variable vlan of type Vlan
[ERROR] <http://jenkins.buildacloud.org/job/build-master-jdk18/ws/plugins/network-elements/brocade-vcs/src/com/cloud/network/brocade/BrocadeVcsApi.java>:[285,8]
error: cannot find symbol
[ERROR] symbol:   class PortProfileGlobal
[ERROR] location: class BrocadeVcsApi
[ERROR] <http://jenkins.buildacloud.org/job/build-master-jdk18/ws/plugins/network-elements/brocade-vcs/src/com/cloud/network/brocade/BrocadeVcsApi.java>:[285,50]
error: cannot find symbol
[ERROR] symbol:   class PortProfileGlobal
[ERROR] location: class BrocadeVcsApi
[ERROR] <http://jenkins.buildacloud.org/job/build-master-jdk18/ws/plugins/network-elements/brocade-vcs/src/com/cloud/network/brocade/BrocadeVcsApi.java>:[286,34]
error: PortProfile() is not public in PortProfile; cannot be accessed from outside package
[ERROR] <http://jenkins.buildacloud.org/job/build-master-jdk18/ws/plugins/network-elements/brocade-vcs/src/com/cloud/network/brocade/BrocadeVcsApi.java>:[287,19]
error: cannot find symbol
[ERROR] symbol:   method setName(String)
[ERROR] location: variable portProfile of type PortProfile
[ERROR] <http://jenkins.buildacloud.org/job/build-master-jdk18/ws/plugins/network-elements/brocade-vcs/src/com/cloud/network/brocade/BrocadeVcsApi.java>:[288,8]
error: cannot find symbol
[ERROR] symbol:   class Activate
[ERROR] location: class BrocadeVcsApi
[ERROR] <http://jenkins.buildacloud.org/job/build-master-jdk18/ws/plugins/network-elements/brocade-vcs/src/com/cloud/network/brocade/BrocadeVcsApi.java>:[288,32]
error: cannot find symbol
[ERROR] symbol:   class Activate
[ERROR] location: class BrocadeVcsApi
[ERROR] <http://jenkins.buildacloud.org/job/build-master-jdk18/ws/plugins/network-elements/brocade-vcs/src/com/cloud/network/brocade/BrocadeVcsApi.java>:[302,34]
error: PortProfile() is not public in PortProfile; cannot be accessed from outside package
[ERROR] <http://jenkins.buildacloud.org/job/build-master-jdk18/ws/plugins/network-elements/brocade-vcs/src/com/cloud/network/brocade/BrocadeVcsApi.java>:[303,19]
error: cannot find symbol
[ERROR] symbol:   method setName(String)
[ERROR] location: variable portProfile of type PortProfile
[ERROR] <http://jenkins.buildacloud.org/job/build-master-jdk18/ws/plugins/network-elements/brocade-vcs/src/com/cloud/network/brocade/BrocadeVcsApi.java>:[304,19]
error: cannot find symbol
[ERROR] symbol:   method setOperation(String)
[ERROR] location: variable portProfile of type PortProfile
[ERROR] <http://jenkins.buildacloud.org/job/build-master-jdk18/ws/plugins/network-elements/brocade-vcs/src/com/cloud/network/brocade/BrocadeVcsApi.java>:[368,8]
error: cannot find symbol
[ERROR] symbol:   class Output
[ERROR] location: class BrocadeVcsApi
[ERROR] <http://jenkins.buildacloud.org/job/build-master-jdk18/ws/plugins/network-elements/brocade-vcs/src/com/cloud/network/brocade/BrocadeVcsApi.java>:[370,58]
error: cannot find symbol
[ERROR] symbol:   class Output
[ERROR] location: class BrocadeVcsApi
[ERROR] <http://jenkins.buildacloud.org/job/build-master-jdk18/ws/plugins/network-elements/brocade-vcs/src/com/cloud/network/brocade/BrocadeVcsApi.java>:[377,34]
error: cannot find symbol
[ERROR] symbol:   class Output
[ERROR] location: class BrocadeVcsApi
[ERROR] <http://jenkins.buildacloud.org/job/build-master-jdk18/ws/plugins/network-elements/brocade-vcs/src/com/cloud/network/brocade/BrocadeVcsApi.java>:[378,26]
error: cannot find symbol
[ERROR] -> [Help 1]
[ERROR] 
[ERROR] To see the full stack trace of the errors, re-run Maven with the -e switch.
[ERROR] Re-run Maven using the -X switch to enable full debug logging.
[ERROR] 
[ERROR] For more information about the errors and possible solutions, please read the following
articles:
[ERROR] [Help 1] http://cwiki.apache.org/confluence/display/MAVEN/MojoFailureException
[ERROR] 
[ERROR] After correcting the problems, you can resume the build with the command
[ERROR]   mvn <goals> -rf :cloud-plugin-network-vcs
Build step 'Invoke top-level Maven targets' marked build as failure
Recording test results

Mime
View raw message