cloudstack-dev mailing list archives

Site index · List index
Message view « Date » · « Thread »
Top « Date » · « Thread »
From jenk...@cloudstack.org
Subject Build failed in Jenkins: build-master-slowbuild #2320
Date Wed, 16 Sep 2015 11:15:11 GMT
See <http://jenkins.buildacloud.org/job/build-master-slowbuild/2320/changes>

Changes:

[sureshkumar.anaparti] CLOUDSTACK-8820: Showing error when try to add advance zone using VMWare
ESXi 6.0 host

[wido] CLOUDSTACK-8625: Systemd profile for CloudStack Agent

[wido] CLOUDSTACK-8443: Install the systemd wrapper script in RPM

[wido] CLOUDSTACK-8625: Updated spec file for systemd profile

[sureshkumar.anaparti] CLOUDSTACK-8820: Updated the code for vCenter6 data center support.

[wido] CLOUDSTACK-8625: Remove the need of a wrapper script for the Agent

[Rajani Karuturi] changed the base iso file from debian-7.8.0 to debian-7.9.0

[Rohit Yadav] schema: add 4.5.2 to 4.5.3 upgrade path stubs

[Rohit Yadav] schema: add 4.5.3 to 4.6.0 upgrade path stubs

[Rohit Yadav] Revert "changed the base iso file from debian-7.8.0 to debian-7.9.0"

------------------------------------------
[...truncated 22036 lines...]
2015-09-16 11:04:08 DEBUG DefaultListableBeanFactory:243 - Returning cached instance of singleton
bean 'globoDnsElementTest.TestConfiguration'
2015-09-16 11:04:08 DEBUG DefaultListableBeanFactory:506 - Eagerly caching bean 'componentContext'
to allow for resolving potential circular references
2015-09-16 11:04:08 INFO  ComponentContext:59 - Setup Spring Application context
2015-09-16 11:04:08 DEBUG DefaultListableBeanFactory:460 - Finished creating instance of bean
'componentContext'
2015-09-16 11:04:08 DEBUG DefaultListableBeanFactory:215 - Creating shared instance of singleton
bean 'transactionContextBuilder'
2015-09-16 11:04:08 DEBUG DefaultListableBeanFactory:432 - Creating instance of bean 'transactionContextBuilder'
2015-09-16 11:04:08 DEBUG DefaultListableBeanFactory:243 - Returning cached instance of singleton
bean 'globoDnsElementTest.TestConfiguration'
2015-09-16 11:04:08 DEBUG DefaultListableBeanFactory:506 - Eagerly caching bean 'transactionContextBuilder'
to allow for resolving potential circular references
2015-09-16 11:04:08 DEBUG DefaultListableBeanFactory:460 - Finished creating instance of bean
'transactionContextBuilder'
2015-09-16 11:04:08 DEBUG DefaultListableBeanFactory:243 - Returning cached instance of singleton
bean 'instantiatePostProcessor'
2015-09-16 11:04:08 DEBUG GenericApplicationContext:860 - Unable to locate LifecycleProcessor
with name 'lifecycleProcessor': using default [org.springframework.context.support.DefaultLifecycleProcessor@10dc8850]
2015-09-16 11:04:08 DEBUG DefaultListableBeanFactory:243 - Returning cached instance of singleton
bean 'lifecycleProcessor'
2015-09-16 11:04:08 DEBUG PropertySourcesPropertyResolver:81 - Searching for key 'spring.liveBeansView.mbeanDomain'
in [systemProperties]
2015-09-16 11:04:08 DEBUG PropertySourcesPropertyResolver:81 - Searching for key 'spring.liveBeansView.mbeanDomain'
in [systemEnvironment]
2015-09-16 11:04:08 DEBUG PropertySourcesPropertyResolver:103 - Could not find key 'spring.liveBeansView.mbeanDomain'
in any property source. Returning [null]
2015-09-16 11:04:08 DEBUG CacheAwareContextLoaderDelegate:97 - Storing ApplicationContext
in cache under key [[MergedContextConfiguration@16b2145c testClass = GloboDnsElementTest,
locations = '{}', classes = '{class com.globo.globodns.cloudstack.element.GloboDnsElementTest$TestConfiguration}',
contextInitializerClasses = '[]', activeProfiles = '{}', contextLoader = 'org.springframework.test.context.support.AnnotationConfigContextLoader',
parent = [null]]]
2015-09-16 11:04:08 DEBUG cache:114 - Spring test ApplicationContext cache statistics: [ContextCache@1bba5fad
size = 1, hitCount = 0, missCount = 17, parentContextCount = 0]
2015-09-16 11:04:08 DEBUG InjectionMetadata:85 - Processing injected method of bean 'com.globo.globodns.cloudstack.element.GloboDnsElementTest':
AutowiredFieldElement for com.cloud.dc.dao.DataCenterDao com.globo.globodns.cloudstack.element.GloboDnsElementTest._datacenterDao
2015-09-16 11:04:08 DEBUG DefaultListableBeanFactory:243 - Returning cached instance of singleton
bean 'dataCenterDao'
2015-09-16 11:04:08 DEBUG AutowiredAnnotationBeanPostProcessor:445 - Autowiring by type from
bean name 'com.globo.globodns.cloudstack.element.GloboDnsElementTest' to bean named 'dataCenterDao'
2015-09-16 11:04:08 DEBUG InjectionMetadata:85 - Processing injected method of bean 'com.globo.globodns.cloudstack.element.GloboDnsElementTest':
AutowiredFieldElement for com.globo.globodns.cloudstack.element.GloboDnsElement com.globo.globodns.cloudstack.element.GloboDnsElementTest._globodnsElement
2015-09-16 11:04:08 DEBUG DefaultListableBeanFactory:243 - Returning cached instance of singleton
bean 'globoDnsElement'
2015-09-16 11:04:08 DEBUG AutowiredAnnotationBeanPostProcessor:445 - Autowiring by type from
bean name 'com.globo.globodns.cloudstack.element.GloboDnsElementTest' to bean named 'globoDnsElement'
2015-09-16 11:04:08 DEBUG InjectionMetadata:85 - Processing injected method of bean 'com.globo.globodns.cloudstack.element.GloboDnsElementTest':
AutowiredFieldElement for com.cloud.host.dao.HostDao com.globo.globodns.cloudstack.element.GloboDnsElementTest._hostDao
2015-09-16 11:04:08 DEBUG DefaultListableBeanFactory:243 - Returning cached instance of singleton
bean 'hostDao'
2015-09-16 11:04:08 DEBUG AutowiredAnnotationBeanPostProcessor:445 - Autowiring by type from
bean name 'com.globo.globodns.cloudstack.element.GloboDnsElementTest' to bean named 'hostDao'
2015-09-16 11:04:08 DEBUG InjectionMetadata:85 - Processing injected method of bean 'com.globo.globodns.cloudstack.element.GloboDnsElementTest':
AutowiredFieldElement for com.cloud.agent.AgentManager com.globo.globodns.cloudstack.element.GloboDnsElementTest._agentMgr
2015-09-16 11:04:08 DEBUG DefaultListableBeanFactory:243 - Returning cached instance of singleton
bean 'agentManager'
2015-09-16 11:04:08 DEBUG AutowiredAnnotationBeanPostProcessor:445 - Autowiring by type from
bean name 'com.globo.globodns.cloudstack.element.GloboDnsElementTest' to bean named 'agentManager'
2015-09-16 11:04:08 DEBUG InjectionMetadata:85 - Processing injected method of bean 'com.globo.globodns.cloudstack.element.GloboDnsElementTest':
AutowiredFieldElement for com.cloud.user.AccountManager com.globo.globodns.cloudstack.element.GloboDnsElementTest._acctMgr
2015-09-16 11:04:08 DEBUG DefaultListableBeanFactory:243 - Returning cached instance of singleton
bean 'accountManager'
2015-09-16 11:04:08 DEBUG AutowiredAnnotationBeanPostProcessor:445 - Autowiring by type from
bean name 'com.globo.globodns.cloudstack.element.GloboDnsElementTest' to bean named 'accountManager'
2015-09-16 11:04:08 DEBUG DefaultListableBeanFactory:243 - Returning cached instance of singleton
bean 'globoDnsElement'
2015-09-16 11:04:08 DEBUG InjectionMetadata:85 - Processing injected method of bean 'globoDnsElement':
AutowiredFieldElement for com.cloud.dc.dao.DataCenterDao com.globo.globodns.cloudstack.element.GloboDnsElement._dcDao
2015-09-16 11:04:08 DEBUG DefaultListableBeanFactory:243 - Returning cached instance of singleton
bean 'dataCenterDao'
2015-09-16 11:04:08 DEBUG AutowiredAnnotationBeanPostProcessor:445 - Autowiring by type from
bean name 'globoDnsElement' to bean named 'dataCenterDao'
2015-09-16 11:04:08 DEBUG InjectionMetadata:85 - Processing injected method of bean 'globoDnsElement':
AutowiredFieldElement for com.cloud.host.dao.HostDao com.globo.globodns.cloudstack.element.GloboDnsElement._hostDao
2015-09-16 11:04:08 DEBUG DefaultListableBeanFactory:243 - Returning cached instance of singleton
bean 'hostDao'
2015-09-16 11:04:08 DEBUG AutowiredAnnotationBeanPostProcessor:445 - Autowiring by type from
bean name 'globoDnsElement' to bean named 'hostDao'
2015-09-16 11:04:08 DEBUG InjectionMetadata:85 - Processing injected method of bean 'globoDnsElement':
AutowiredFieldElement for com.cloud.network.dao.PhysicalNetworkDao com.globo.globodns.cloudstack.element.GloboDnsElement._physicalNetworkDao
2015-09-16 11:04:08 DEBUG DefaultListableBeanFactory:243 - Returning cached instance of singleton
bean 'physicalNetworkDao'
2015-09-16 11:04:08 DEBUG AutowiredAnnotationBeanPostProcessor:445 - Autowiring by type from
bean name 'globoDnsElement' to bean named 'physicalNetworkDao'
2015-09-16 11:04:08 DEBUG InjectionMetadata:85 - Processing injected method of bean 'globoDnsElement':
AutowiredFieldElement for com.cloud.agent.AgentManager com.globo.globodns.cloudstack.element.GloboDnsElement._agentMgr
2015-09-16 11:04:08 DEBUG DefaultListableBeanFactory:243 - Returning cached instance of singleton
bean 'agentManager'
2015-09-16 11:04:08 DEBUG AutowiredAnnotationBeanPostProcessor:445 - Autowiring by type from
bean name 'globoDnsElement' to bean named 'agentManager'
2015-09-16 11:04:08 DEBUG InjectionMetadata:85 - Processing injected method of bean 'globoDnsElement':
AutowiredFieldElement for com.cloud.resource.ResourceManager com.globo.globodns.cloudstack.element.GloboDnsElement._resourceMgr
2015-09-16 11:04:08 DEBUG DefaultListableBeanFactory:243 - Returning cached instance of singleton
bean 'resourceManager'
2015-09-16 11:04:08 DEBUG AutowiredAnnotationBeanPostProcessor:445 - Autowiring by type from
bean name 'globoDnsElement' to bean named 'resourceManager'
2015-09-16 11:04:08 DEBUG DefaultListableBeanFactory:243 - Returning cached instance of singleton
bean 'globoDnsElement'
2015-09-16 11:04:08 INFO  ComponentContext:108 - Configuring com.globo.globodns.cloudstack.element.GloboDnsElement_EnhancerByCloudStack_943affe4
2015-09-16 11:04:08 INFO  ComponentContext:132 - Starting com.globo.globodns.cloudstack.element.GloboDnsElement_EnhancerByCloudStack_943affe4
2015-09-16 11:04:08 DEBUG DirtiesContextTestExecutionListener:107 - After test method: context
[[TestContext@78dafccd testClass = GloboDnsElementTest, testInstance = com.globo.globodns.cloudstack.element.GloboDnsElementTest@77f21ee8,
testMethod = testReleaseMethodCallResource@GloboDnsElementTest, testException = [null], mergedContextConfiguration
= [MergedContextConfiguration@16b2145c testClass = GloboDnsElementTest, locations = '{}',
classes = '{class com.globo.globodns.cloudstack.element.GloboDnsElementTest$TestConfiguration}',
contextInitializerClasses = '[]', activeProfiles = '{}', contextLoader = 'org.springframework.test.context.support.AnnotationConfigContextLoader',
parent = [null]]]], class dirties context [true], class mode [AFTER_EACH_TEST_METHOD], method
dirties context [false].
2015-09-16 11:04:08 INFO  GenericApplicationContext:1044 - Closing org.springframework.context.support.GenericApplicationContext@38cb4edd:
startup date [Wed Sep 16 11:04:08 UTC 2015]; root of context hierarchy
2015-09-16 11:04:08 DEBUG DefaultListableBeanFactory:243 - Returning cached instance of singleton
bean 'lifecycleProcessor'
2015-09-16 11:04:08 INFO  DefaultListableBeanFactory:444 - Destroying singletons in org.springframework.beans.factory.support.DefaultListableBeanFactory@2ba6ac4c:
defining beans [org.springframework.context.annotation.internalConfigurationAnnotationProcessor,org.springframework.context.annotation.internalAutowiredAnnotationProcessor,org.springframework.context.annotation.internalRequiredAnnotationProcessor,org.springframework.context.annotation.internalCommonAnnotationProcessor,globoDnsElementTest.TestConfiguration,org.springframework.context.annotation.ConfigurationClassPostProcessor.importAwareProcessor,globoDnsElement,dataCenterDao,physicalNetworkDao,networkDao,hostDao,configurationDao,agentManager,resourceManager,accountManager,componentContext,transactionContextBuilder,instantiatePostProcessor];
root of factory hierarchy
2015-09-16 11:04:08 DEBUG DefaultListableBeanFactory:500 - Retrieved dependent beans for bean
'accountManager': [com.globo.globodns.cloudstack.element.GloboDnsElementTest]
2015-09-16 11:04:08 DEBUG DefaultListableBeanFactory:500 - Retrieved dependent beans for bean
'resourceManager': [globoDnsElement]
2015-09-16 11:04:08 DEBUG DisposableBeanAdapter:227 - Invoking destroy() on bean with name
'globoDnsElementTest.TestConfiguration'
2015-09-16 11:04:08 DEBUG DirtiesContextTestExecutionListener:138 - After test class: context
[[TestContext@78dafccd testClass = GloboDnsElementTest, testInstance = [null], testMethod
= [null], testException = [null], mergedContextConfiguration = [MergedContextConfiguration@16b2145c
testClass = GloboDnsElementTest, locations = '{}', classes = '{class com.globo.globodns.cloudstack.element.GloboDnsElementTest$TestConfiguration}',
contextInitializerClasses = '[]', activeProfiles = '{}', contextLoader = 'org.springframework.test.context.support.AnnotationConfigContextLoader',
parent = [null]]]], dirtiesContext [true].
Tests run: 3, Failures: 0, Errors: 0, Skipped: 0, Time elapsed: 1.078 sec - in com.globo.globodns.cloudstack.element.GloboDnsElementTest

Results :

Tests run: 17, Failures: 0, Errors: 0, Skipped: 0

[INFO] 
[INFO] <<< cobertura-maven-plugin:2.6:cobertura (default-cli) @ cloud-plugin-network-globodns
<<<
[INFO] 
[INFO] --- cobertura-maven-plugin:2.6:cobertura (default-cli) @ cloud-plugin-network-globodns
---
[INFO] Cobertura 2.0.3 - GNU GPL License (NO WARRANTY) - See COPYRIGHT file
[cobertura] INFO  [main] net.sourceforge.cobertura.reporting.html.HTMLReport - Data file does
not contain instrumentation information for the file com/globo/globodns/cloudstack/element/GloboDnsElementService.java.
 Ensure this class was instrumented, and this data file contains the instrumentation information.
Report time: 405ms

[ERROR] Sep 16, 2015 11:04:09 AM net.sourceforge.cobertura.coveragedata.CoverageDataFileHandler
loadCoverageData
INFO: Cobertura: Loaded information on 15 classes.

[INFO] Cobertura Report generation was successful.
[INFO] Cobertura 2.0.3 - GNU GPL License (NO WARRANTY) - See COPYRIGHT file
Report time: 370ms

[ERROR] Sep 16, 2015 11:04:10 AM net.sourceforge.cobertura.coveragedata.CoverageDataFileHandler
loadCoverageData
INFO: Cobertura: Loaded information on 15 classes.

[INFO] Cobertura Report generation was successful.
[INFO]                                                                         
[INFO] ------------------------------------------------------------------------
[INFO] Building Apache CloudStack Plugin - NetApp File System 4.6.0-SNAPSHOT
[INFO] ------------------------------------------------------------------------
[WARNING] The POM for org.eclipse.m2e:lifecycle-mapping:jar:1.0.0 is missing, no dependency
information available
[WARNING] Failed to retrieve plugin descriptor for org.eclipse.m2e:lifecycle-mapping:1.0.0:
Plugin org.eclipse.m2e:lifecycle-mapping:1.0.0 or one of its dependencies could not be resolved:
Failed to read artifact descriptor for org.eclipse.m2e:lifecycle-mapping:jar:1.0.0
[INFO] 
[INFO] --- maven-clean-plugin:2.5:clean (default-clean) @ cloud-plugin-netapp ---
[INFO] Deleting <http://jenkins.buildacloud.org/job/build-master-slowbuild/ws/plugins/file-systems/netapp/target>
(includes = [**/*], excludes = [])
[INFO] Deleting <http://jenkins.buildacloud.org/job/build-master-slowbuild/ws/plugins/file-systems/netapp>
(includes = [target, dist], excludes = [])
[INFO] 
[INFO] --- maven-checkstyle-plugin:2.11:check (cloudstack-checkstyle) @ cloud-plugin-netapp
---
[INFO] Starting audit...
Audit done.

[INFO] 
[INFO] --- maven-remote-resources-plugin:1.3:process (default) @ cloud-plugin-netapp ---
[INFO] 
[INFO] --- maven-resources-plugin:2.5:resources (default-resources) @ cloud-plugin-netapp
---
[debug] execute contextualize
[INFO] Using 'UTF-8' encoding to copy filtered resources.
[INFO] skip non existing resourceDirectory <http://jenkins.buildacloud.org/job/build-master-slowbuild/ws/plugins/file-systems/netapp/resources>
[INFO] Copying 3 resources
[INFO] 
ha:AAAAYB+LCAAAAAAAAP9b85aBtbiIQSmjNKU4P0[INFO] Done FindBugs Analysis....
[INFO] 
[INFO] <<< findbugs-maven-plugin:3.0.1:check (cloudstack-findbugs) @ cloud-plugin-netapp
<<<
[INFO] 
[INFO] --- findbugs-maven-plugin:3.0.1:check (cloudstack-findbugs) @ cloud-plugin-netapp ---
[INFO] BugInstance size is 0
[INFO] Error size is 0
[INFO] No errors/warnings found
[INFO] 
[INFO] --- maven-resources-plugin:2.5:testResources (default-testResources) @ cloud-plugin-netapp
---
[debug] execute contextualize
[INFO] Using 'UTF-8' encoding to copy filtered resources.
[INFO] skip non existing resourceDirectory <http://jenkins.buildacloud.org/job/build-master-slowbuild/ws/plugins/file-systems/netapp/test/resources>
[INFO] Copying 3 resources
[INFO] 
[INFO] --- maven-compiler-plugin:3.2:testCompile (default-testCompile) @ cloud-plugin-netapp
---
[INFO] No sources to compile
[INFO] 
[INFO] --- maven-surefire-plugin:2.18.1:test (default-test) @ cloud-plugin-netapp ---
[INFO] 
[INFO] --- maven-jar-plugin:2.5:jar (default-jar) @ cloud-plugin-netapp ---
[INFO] Building jar: <http://jenkins.buildacloud.org/job/build-master-slowbuild/ws/plugins/file-systems/netapp/target/cloud-plugin-netapp-4.6.0-SNAPSHOT.jar>
[INFO] 
[INFO] --- maven-site-plugin:3.1:attach-descriptor (attach-descriptor) @ cloud-plugin-netapp
---
[INFO] 
[INFO] --- maven-install-plugin:2.3.1:install (default-install) @ cloud-plugin-netapp ---
[INFO] Installing <http://jenkins.buildacloud.org/job/build-master-slowbuild/ws/plugins/file-systems/netapp/target/cloud-plugin-netapp-4.6.0-SNAPSHOT.jar>
to /home/jenkins/.m2/repository/org/apache/cloudstack/cloud-plugin-netapp/4.6.0-SNAPSHOT/cloud-plugin-netapp-4.6.0-SNAPSHOT.jar
[INFO] Installing <http://jenkins.buildacloud.org/job/build-master-slowbuild/ws/plugins/file-systems/netapp/pom.xml>
to /home/jenkins/.m2/repository/org/apache/cloudstack/cloud-plugin-netapp/4.6.0-SNAPSHOT/cloud-plugin-netapp-4.6.0-SNAPSHOT.pom
[INFO] 
[INFO] >>> cobertura-maven-plugin:2.6:cobertura (default-cli) @ cloud-plugin-netapp
>>>
[INFO] 
[INFO] --- maven-checkstyle-plugin:2.11:check (cloudstack-checkstyle) @ cloud-plugin-netapp
---
[INFO] Starting audit...
Audit done.

[INFO] 
[INFO] --- maven-remote-resources-plugin:1.3:process (default) @ cloud-plugin-netapp ---
[INFO] 
[INFO] --- maven-resources-plugin:2.5:resources (default-resources) @ cloud-plugin-netapp
---
[debug] execute contextualize
[INFO] Using 'UTF-8' encoding to copy filtered resources.
[INFO] skip non existing resourceDirectory <http://jenkins.buildacloud.org/job/build-master-slowbuild/ws/plugins/file-systems/netapp/resources>
[INFO] Copying 3 resources
[INFO] Copying 3 resources
[INFO] 
[INFO] --- maven-compiler-plugin:3.2:compile (default-compile) @ cloud-plugin-netapp ---
[INFO] Nothing to compile - all classes are up to date
[INFO] 
[INFO] >>> findbugs-maven-plugin:3.0.1:check (cloudstack-findbugs) @ cloud-plugin-netapp
>>>
[INFO] 
[INFO] --- findbugs-maven-plugin:3.0.1:findbugs (findbugs) @ cloud-plugin-netapp ---
[INFO] Fork Value is true
[INFO] Done FindBugs Analysis....
[INFO] 
[INFO] <<< findbugs-maven-plugin:3.0.1:check (cloudstack-findbugs) @ cloud-plugin-netapp
<<<
[INFO] 
[INFO] --- findbugs-maven-plugin:3.0.1:check (cloudstack-findbugs) @ cloud-plugin-netapp ---
[INFO] BugInstance size is 0
[INFO] Error size is 0
[INFO] No errors/warnings found
[INFO] 
[INFO] --- cobertura-maven-plugin:2.6:instrument (default-cli) @ cloud-plugin-netapp ---
[INFO] Cobertura 2.0.3 - GNU GPL License (NO WARRANTY) - See COPYRIGHT file

[ERROR] Sep 16, 2015 11:04:39 AM net.sourceforge.cobertura.coveragedata.CoverageDataFileHandler
saveCoverageData
INFO: Cobertura: Saved information on 27 classes.

[INFO] Instrumentation was successful.
[INFO] NOT adding cobertura ser file to attached artifacts list.
[INFO] 
[INFO] --- maven-resources-plugin:2.5:testResources (default-testResources) @ cloud-plugin-netapp
---
[debug] execute contextualize
[INFO] Using 'UTF-8' encoding to copy filtered resources.
[INFO] skip non existing resourceDirectory <http://jenkins.buildacloud.org/job/build-master-slowbuild/ws/plugins/file-systems/netapp/test/resources>
[INFO] Copying 3 resources
[INFO] Copying 3 resources
[INFO] 
[INFO] --- maven-compiler-plugin:3.2:testCompile (default-testCompile) @ cloud-plugin-netapp
---
[INFO] No sources to compile
[INFO] 
[INFO] --- maven-surefire-plugin:2.18.1:test (default-test) @ cloud-plugin-netapp ---
[INFO] 
[INFO] <<< cobertura-maven-plugin:2.6:cobertura (default-cli) @ cloud-plugin-netapp
<<<
[INFO] 
[INFO] --- cobertura-maven-plugin:2.6:cobertura (default-cli) @ cloud-plugin-netapp ---
[INFO] Cobertura 2.0.3 - GNU GPL License (NO WARRANTY) - See COPYRIGHT file
[cobertura] INFO  [main] net.sourceforge.cobertura.reporting.html.HTMLReport - Data file does
not contain instrumentation information for the file com/cloud/netapp/NetappAllocator.java.
 Ensure this class was instrumented, and this data file contains the instrumentation information.
[cobertura] INFO  [main] net.sourceforge.cobertura.reporting.html.HTMLReport - Data file does
not contain instrumentation information for the file com/cloud/netapp/NetappManager.java.
 Ensure this class was instrumented, and this data file contains the instrumentation information.
[cobertura] INFO  [main] net.sourceforge.cobertura.reporting.html.HTMLReport - Data file does
not contain instrumentation information for the file com/cloud/netapp/dao/LunDao.java.  Ensure
this class was instrumented, and this data file contains the instru[INFO] Starting audit...
Audit done.

[INFO] 
[INFO] --- maven-remote-resources-plugin:1.3:process (default) @ cloud-plugin-network-vsp
---
[INFO] 
[INFO] --- maven-resources-plugin:2.5:resources (default-resources) @ cloud-plugin-network-vsp
---
[debug] execute contextualize
[INFO] Using 'UTF-8' encoding to copy filtered resources.
[INFO] Copying 2 resources
[INFO] Copying 3 resources
[INFO] 
[INFO] --- maven-compiler-plugin:3.2:compile (default-compile) @ cloud-plugin-network-vsp
---
[INFO] Changes detected - recompiling the module!
[INFO] Compiling 43 source files to <http://jenkins.buildacloud.org/job/build-master-slowbuild/ws/plugins/network-elements/nuage-vsp/target/classes>
[INFO] 
[INFO] --- license-maven-plugin:2.7:check (cloudstack-checklicence) @ cloud-plugin-network-vsp
---
[INFO] Checking licenses...
[INFO] 
[INFO] >>> findbugs-maven-plugin:3.0.1:check (cloudstack-findbugs) @ cloud-plugin-network-vsp
>>>
[INFO] 
[INFO] --- findbugs-maven-plugin:3.0.1:findbugs (findbugs) @ cloud-plugin-network-vsp ---
[INFO] Fork Value is true
[INFO] Done FindBugs Analysis....
[INFO] 
[INFO] <<< findbugs-maven-plugin:3.0.1:check (cloudstack-findbugs) @ cloud-plugin-network-vsp
<<<
[INFO] 
[INFO] --- findbugs-maven-plugin:3.0.1:check (cloudstack-findbugs) @ cloud-plugin-network-vsp
---
[INFO] BugInstance size is 0
[INFO] Error size is 0
[INFO] No errors/warnings found
[INFO] 
[INFO] --- maven-resources-plugin:2.5:testResources (default-testResources) @ cloud-plugin-network-vsp
---
[debug] execute contextualize
[INFO] Using 'UTF-8' encoding to copy filtered resources.
[INFO] skip non existing resourceDirectory <http://jenkins.buildacloud.org/job/build-master-slowbuild/ws/plugins/network-elements/nuage-vsp/test/resources>
[INFO] Copying 3 resources
[INFO] 
[INFO] --- maven-compiler-plugin:3.2:testCompile (default-testCompile) @ cloud-plugin-network-vsp
---
[INFO] Changes detected - recompiling the module!
[INFO] Compiling 5 source files to <http://jenkins.buildacloud.org/job/build-master-slowbuild/ws/plugins/network-elements/nuage-vsp/target/test-classes>
[INFO] 
[INFO] --- maven-surefire-plugin:2.18.1:test (default-test) @ cloud-plugin-network-vsp ---
[INFO] Surefire report directory: <http://jenkins.buildacloud.org/job/build-master-slowbuild/ws/plugins/network-elements/nuage-vsp/target/surefire-reports>

-------------------------------------------------------
 T E S T S
-------------------------------------------------------
Running com.cloud.network.resource.NuageVspResourceTest
Tests run: 13, Failures: 0, Errors: 0, Skipped: 0, Time elapsed: 1.625 sec - in com.cloud.network.resource.NuageVspResourceTest
Running com.cloud.network.sync.NuageVspSyncTest
Tests run: 1, Failures: 0, Errors: 0, Skipped: 0, Time elapsed: 0.814 sec - in com.cloud.network.sync.NuageVspSyncTest
Running

Mime
View raw message