cloudstack-dev mailing list archives

Site index · List index
Message view « Date » · « Thread »
Top « Date » · « Thread »
From jenk...@cloudstack.org
Subject Build failed in Jenkins: build-4.5 #525
Date Mon, 14 Sep 2015 04:36:26 GMT
See <http://jenkins.buildacloud.org/job/build-4.5/525/changes>

Changes:

[wido] CLOUDSTACK-8443: Support CentOS 7 for 4.5

------------------------------------------
[...truncated 3810 lines...]
[INFO] --- maven-surefire-plugin:2.12:test (default-test) @ cloud-plugin-syslog-alerts ---
[INFO] Surefire report directory: <http://jenkins.buildacloud.org/job/build-4.5/ws/plugins/alert-handlers/syslog-alerts/target/surefire-reports>

-------------------------------------------------------
 T E S T S
-------------------------------------------------------
Running org.apache.cloudstack.alert.snmp.SnmpEnhancedPatternLayoutTest
[INFO] 
[INFO] --- maven-resources-plugin:2.5:resources (default-resources) @ cloud-plugin-network-vxlan
---
[debug] execute contextualize
[INFO] Using 'UTF-8' encoding to copy filtered resources.
[INFO] Copying 2 resources
[INFO] Copying 3 resources
[INFO] 
[INFO] --- maven-compiler-plugin:2.5.1:compile (default-compile) @ cloud-plugin-network-vxlan
---
[INFO] Compiling 1 source file to <http://jenkins.buildacloud.org/job/build-4.5/ws/plugins/network-elements/vxlan/target/classes>
Running org.apache.cloudstack.syslog.AlertsSyslogAppenderTest
log4j:ERROR  Invalid format for the IP Addresses parameter 
Tests run: 6, Failures: 0, Errors: 0, Skipped: 0, Time elapsed: 1.738 sec

Results :

Tests run: 6, Failures: 0, Errors: 0, Skipped: 0

[INFO]                                                                         
[INFO] ------------------------------------------------------------------------
[INFO] Building Apache CloudStack Plugin - GloboDNS 4.5.2
[INFO] ------------------------------------------------------------------------
log4j:WARN No appenders could be found for logger (org.apache.cloudstack.saml.SAML2AuthManagerImpl).
log4j:WARN Please initialize the log4j system properly.
log4j:WARN See http://logging.apache.org/log4j/1.2/faq.html#noconfig for more info.
Tests run: 9, Failures: 0, Errors: 0, Skipped: 0, Time elapsed: 6.748 sec
Running org.apache.cloudstack.SAML2UserAuthenticatorTest
[INFO] 
[INFO] --- maven-clean-plugin:2.5:clean (default-clean) @ cloud-plugin-network-globodns ---
[INFO] Deleting <http://jenkins.buildacloud.org/job/build-4.5/ws/plugins/network-elements/globodns>
(includes = [target, dist], excludes = [])
[INFO] 
[INFO] --- maven-checkstyle-plugin:2.11:check (cloudstack-checkstyle) @ cloud-plugin-network-globodns
---
Tests run: 4, Failures: 0, Errors: 0, Skipped: 0, Time elapsed: 4.276 sec
Running org.apache.cloudstack.alert.snmp.SnmpTrapAppenderTest
Tests run: 2, Failures: 0, Errors: 0, Skipped: 0, Time elapsed: 1.746 sec
Running org.apache.cloudstack.GetServiceProviderMetaDataCmdTest
[INFO] Starting audit...
Audit done.

[INFO] 
[INFO] --- maven-remote-resources-plugin:1.3:process (default) @ cloud-plugin-network-globodns
---
[INFO] 
[INFO] --- maven-resources-plugin:2.5:resources (default-resources) @ cloud-plugin-network-globodns
---
[debug] execute contextualize
[INFO] Using 'UTF-8' encoding to copy filtered resources.
[INFO] Copying 2 resources
log4j:ERROR  Invalid format for the IP Addresses or Ports parameter 
log4j:ERROR  size of ip addresses , communities, and ports list doesn't match, setting all
to null
log4j:ERROR  size of ip addresses , communities, and ports list doesn't match, setting all
to null
log4j:ERROR  Invalid format for the IP Addresses or Ports parameter 
Tests run: 5, Failures: 0, Errors: 0, Skipped: 0, Time elapsed: 2.741 sec
[INFO] Copying 3 resources
[INFO] 
[INFO] --- maven-compiler-plugin:2.5.1:compile (default-compile) @ cloud-plugin-network-globodns
---
[INFO] Compiling 14 source files to <http://jenkins.buildacloud.org/job/build-4.5/ws/plugins/network-elements/globodns/target/classes>

Results :

Tests run: 9, Failures: 0, Errors: 0, Skipped: 0

[INFO]                                                                         
[INFO] ------------------------------------------------------------------------
[INFO] Building Apache CloudStack Engine Storage Component 4.5.2
[INFO] ------------------------------------------------------------------------
[INFO] 
[INFO] --- maven-clean-plugin:2.5:clean (default-clean) @ cloud-engine-storage ---
[INFO] Deleting <http://jenkins.buildacloud.org/job/build-4.5/ws/engine/storage> (includes
= [target, dist], excludes = [])
[INFO] 
[INFO] --- maven-checkstyle-plugin:2.11:check (cloudstack-checkstyle) @ cloud-engine-storage
---
[INFO] 
[INFO] --- maven-resources-plugin:2.5:testResources (default-testResources) @ cloud-plugin-network-vxlan
---
[debug] execute contextualize
[INFO] Using 'UTF-8' encoding to copy filtered resources.
[INFO] skip non existing resourceDirectory <http://jenkins.buildacloud.org/job/build-4.5/ws/plugins/network-elements/vxlan/test/resources>
[INFO] Copying 3 resources
[INFO] 
[INFO] --- maven-compiler-plugin:2.5.1:testCompile (default-testCompile) @ cloud-plugin-network-vxlan
---
[INFO] Compiling 1 source file to <http://jenkins.buildacloud.org/job/build-4.5/ws/plugins/network-elements/vxlan/target/test-classes>
[INFO] Starting audit...
Audit done.

[INFO] 
[INFO] --- maven-remote-resources-plugin:1.3:process (default) @ cloud-engine-storage ---
[INFO] 
[INFO] --- maven-resources-plugin:2.5:resources (default-resources) @ cloud-engine-storage
---
[debug] execute contextualize
[INFO] Using 'UTF-8' encoding to copy filtered resources.
[INFO] Copying 3 resources
[INFO] Copying 3 resources
[INFO] 
[INFO] --- maven-compiler-plugin:2.5.1:compile (default-compile) @ cloud-engine-storage ---
[INFO] Compiling 60 source files to <http://jenkins.buildacloud.org/job/build-4.5/ws/engine/storage/target/classes>
Build timed out (after 14 minutes). Marking the build as failed.
Build was aborted
Recording test results
[INFO]                                                                         
[INFO] ------------------------------------------------------------------------
[INFO] Skipping Apache CloudStack System VM
[INFO] This project has been banned from the build due to previous failures.
[INFO] ------------------------------------------------------------------------
[INFO]                                                                         
[INFO] ------------------------------------------------------------------------
[INFO] Skipping Apache CloudStack Plugin - Hypervisor KVM
[INFO] This project has been banned from the build due to previous failures.
[INFO] ------------------------------------------------------------------------
[INFO]                                                                         
[INFO] ------------------------------------------------------------------------
[INFO] Skipping Apache CloudStack AWS API Bridge
[INFO] This project has been banned from the build due to previous failures.
[INFO] ------------------------------------------------------------------------

Results :

Tests run: 11, Failures: 0, Errors: 0, Skipped: 0

[INFO] ------------------------------------------------------------------------
[INFO] Reactor Summary:
[INFO] 
[INFO] Apache CloudStack Developer Tools - Checkstyle Configuration  SUCCESS [3.493s]
[INFO] Apache CloudStack ................................. SUCCESS [2.300s]
[INFO] Apache CloudStack Maven Conventions Parent ........ SUCCESS [6.370s]
[INFO] Apache CloudStack Framework - Managed Context ..... SUCCESS [17.866s]
[INFO] Apache CloudStack Utils ........................... SUCCESS [39.859s]
[INFO] Apache CloudStack Framework ....................... SUCCESS [1.002s]
[INFO] Apache CloudStack Framework - Event Notification .. SUCCESS [53.767s]
[INFO] Apache CloudStack Framework - Configuration ....... SUCCESS [17.681s]
[INFO] Apache CloudStack API ............................. SUCCESS [47.083s]
[INFO] Apache CloudStack Framework - REST ................ SUCCESS [22.668s]
[INFO] Apache CloudStack Framework - IPC ................. SUCCESS [18.683s]
[INFO] Apache CloudStack Cloud Engine .................... SUCCESS [0.937s]
[INFO] Apache CloudStack Cloud Engine API ................ SUCCESS [18.326s]
[INFO] Apache CloudStack Framework - Security ............ SUCCESS [12.573s]
[INFO] Apache CloudStack Core ............................ SUCCESS [50.763s]
[INFO] Apache CloudStack Agents .......................... SUCCESS [23.505s]
[INFO] Apache CloudStack Framework - Clustering .......... SUCCESS [21.124s]
[INFO] Apache CloudStack Framework - Event Notification .. SUCCESS [15.293s]
[INFO] Apache CloudStack Cloud Engine Schema Component ... SUCCESS [1:08.213s]
[INFO] Apache CloudStack Framework - Jobs ................ SUCCESS [16.471s]
[INFO] Apache CloudStack Cloud Engine Internal Components API  SUCCESS [8.238s]
[INFO] Apache CloudStack Server .......................... SUCCESS [2:31.449s]
[INFO] Apache CloudStack Usage Server .................... SUCCESS [42.651s]
[INFO] Apache CloudStack Cloud Engine Orchestration Component  SUCCESS [54.273s]
[INFO] Apache CloudStack Cloud Services .................. SUCCESS [0.668s]
[INFO] Apache CloudStack Secondary Storage ............... SUCCESS [11.745s]
[INFO] Apache CloudStack Secondary Storage Service ....... SUCCESS [42.614s]
[INFO] Apache CloudStack Engine Storage Component ........ FAILURE [10.123s]
[INFO] Apache CloudStack Engine Storage Volume Component . SKIPPED
[INFO] Apache CloudStack Engine Storage Image Component .. SKIPPED
[INFO] Apache CloudStack Engine Storage Data Motion Component  SKIPPED
[INFO] Apache CloudStack Engine Storage Cache Component .. SKIPPED
[INFO] Apache CloudStack Engine Storage Snapshot Component  SKIPPED
[INFO] Apache CloudStack Cloud Engine API ................ SUCCESS [12.525s]
[INFO] Apache CloudStack Cloud Engine Service ............ SKIPPED
[INFO] Apache CloudStack Plugin POM ...................... SUCCESS [1.454s]
[INFO] Apache CloudStack Plugin - API Rate Limit ......... SUCCESS [49.328s]
[INFO] Apache CloudStack Plugin - Storage Volume default provider  SKIPPED
[INFO] Apache CloudStack Plugin - Storage Volume SolidFire Provider  SKIPPED
[INFO] Apache CloudStack Plugin - API SolidFire .......... SKIPPED
[INFO] Apache CloudStack Plugin - API Discovery .......... SUCCESS [37.776s]
[INFO] Apache CloudStack Plugin - ACL Static Role Based .. SUCCESS [18.463s]
[INFO] Apache CloudStack Plugin - Host Anti-Affinity Processor  SUCCESS [15.074s]
[INFO] Apache CloudStack Plugin - Explicit Dedication Processor  SUCCESS [17.337s]
[INFO] Apache CloudStack Plugin - User Concentrated Pod Deployment Planner  SUCCESS [18.304s]
[INFO] Apache CloudStack Plugin - User Dispersing Deployment Planner  SUCCESS [16.172s]
[INFO] Apache CloudStack Plugin - Implicit Dedication Planner  SUCCESS [59.911s]
[INFO] Apache CloudStack Plugin - Skip Heurestics Planner  SUCCESS [20.243s]
[INFO] Apache CloudStack Plugin - Host Allocator Random .. SUCCESS [17.199s]
[INFO] Apache CloudStack Plugin - Dedicated Resources .... SUCCESS [53.820s]
[INFO] Apache CloudStack Plugin - Hypervisor OracleVM .... SUCCESS [32.078s]
[INFO] Apache CloudStack Plugin - Open vSwitch ........... SUCCESS [34.527s]
[INFO] Apache CloudStack Plugin - Hypervisor XenServer ... SKIPPED
[INFO] Apache CloudStack Plugin - Hypervisor KVM ......... SKIPPED
[INFO] Apache CloudStack Plugin - RabbitMQ Event Bus ..... SUCCESS [20.054s]
[INFO] Apache CloudStack Plugin - In Memory Event Bus .... SUCCESS [35.288s]
[INFO] Apache CloudStack Plugin - Hypervisor Baremetal ... SUCCESS [38.843s]
[INFO] Apache CloudStack Plugin - Hypervisor UCS ......... SUCCESS [25.452s]
[INFO] Apache CloudStack Plugin - Hypervisor Hyper-V ..... SUCCESS [51.942s]
[INFO] Apache CloudStack Plugin - Network Elastic Load Balancer  SUCCESS [53.904s]
[INFO] Apache CloudStack Plugin - Network Internal Load Balancer  SUCCESS [1:19.978s]
[INFO] Apache CloudStack Framework - Spring Life Cycle ... SUCCESS [10.506s]
[INFO] Apache CloudStack Plugin - Network Juniper Contrail  SKIPPED
[INFO] Apache CloudStack Plugin - Palo Alto .............. SUCCESS [1:06.354s]
[INFO] Apache CloudStack Plugin - Network Netscaler ...... SUCCESS [38.214s]
[INFO] Apache CloudStack Plugin - Network Nicira NVP ..... SUCCESS [1:14.499s]
[INFO] Apache CloudStack Plugin - BigSwitch Virtual Network Segment  SUCCESS [52.491s]
[INFO] Apache CloudStack Plugin - Network Brocade VCS .... SUCCESS [1:20.425s]
[INFO] Apache CloudStack Plugin - Midokura Midonet ....... SKIPPED
[INFO] Apache CloudStack Plugin - Stratosphere SSP ....... SUCCESS [57.294s]
[INFO] Apache CloudStack Plugin - Network Opendaylight ... SUCCESS [53.669s]
[INFO] Apache CloudStack Plugin - Storage Allocator Random  SKIPPED
[INFO] Apache CloudStack Plugin - User Authenticator LDAP  SUCCESS [31.959s]
[INFO] Apache CloudStack Plugin - User Authenticator MD5 . SUCCESS [38.308s]
[INFO] Apache CloudStack Plugin - User Authenticator PBKDF2-SHA-256  SUCCESS [57.289s]
[INFO] Apache CloudStack Plugin - User Authenticator Plain Text  SUCCESS [20.568s]
[INFO] Apache CloudStack Plugin - User Authenticator SAML2  FAILURE [1:17.406s]
[INFO] Apache CloudStack Plugin - User Authenticator SHA256 Salted  SUCCESS [56.085s]
[INFO] Apache CloudStack Plugin - Dns Notifier Example ... SUCCESS [25.607s]
[INFO] Apache CloudStack Plugin - Storage Image S3 ....... SKIPPED
[INFO] Apache CloudStack Plugin - Storage Image Swift provider  SKIPPED
[INFO] Apache CloudStack Plugin - Storage Image default provider  SKIPPED
[INFO] Apache CloudStack Plugin - Storage Image sample provider  SKIPPED
[INFO] Apache CloudStack Plugin - Storage Volume Nexenta Provider  SKIPPED
[INFO] Apache CloudStack Plugin - Storage Volume CloudByte Provider  SKIPPED
[INFO] Apache CloudStack Plugin - Storage Volume sample provider  SKIPPED
[INFO] Apache CloudStack Plugin - SNMP Alerts ............ SUCCESS [39.608s]
[INFO] Apache CloudStack Plugin - Syslog Alerts .......... SUCCESS [29.424s]
[INFO] Apache CloudStack Plugin - Network VXLAN .......... FAILURE [20.197s]
[INFO] Apache CloudStack Plugin - GloboDNS ............... FAILURE [14.721s]
[INFO] Apache CloudStack Framework - Spring Module ....... SUCCESS [49.025s]
[INFO] Apache CloudStack Secondary Storage Controller .... SUCCESS [24.412s]
[INFO] Apache CloudStack Console Proxy - RDP Client ...... SUCCESS [56.308s]
[INFO] Apache CloudStack Console Proxy ................... SUCCESS [11.482s]
[INFO] Apache CloudStack Console Proxy - Server .......... SUCCESS [20.949s]
[INFO] Apache CloudStack System VM ....................... SKIPPED
[INFO] Apache CloudStack Client UI ....................... SKIPPED
[INFO] Apache CloudStack Framework - QuickCloud .......... SUCCESS [5.167s]
[INFO] Apache CloudStack AWS API Bridge .................. SKIPPED
[INFO] ------------------------------------------------------------------------
[INFO] BUILD FAILURE
[INFO] ------------------------------------------------------------------------
[INFO] Total time: 14:41.071s (Wall Clock)
[INFO] Finished at: Mon Sep 14 04:41:43 UTC 2015
[INFO] Final Memory: 62M/218M
[INFO] ------------------------------------------------------------------------
[ERROR] Failed to execute goal org.apache.maven.plugins:maven-compiler-plugin:2.5.1:testCompile
(default-testCompile) on project cloud-plugin-network-vxlan: Fatal error compiling: Unknown
error trying to execute the external compiler:
[ERROR] /bin/sh -c cd <http://jenkins.buildacloud.org/job/build-4.5/ws/plugins/network-elements/vxlan>
&& /usr/lib/jvm/java-1.7.0-openjdk-1.7.0.79-2.5.5.1.el7_1.x86_64/jre/../bin/javac
@/tmp/org.codehaus.plexus.compiler.javac.JavacCompiler7629052111094195798arguments -J-Xmx512m
-J-Xms128m
[ERROR] -> [Help 1]
[ERROR] Failed to execute goal org.apache.maven.plugins:maven-compiler-plugin:2.5.1:compile
(default-compile) on project cloud-engine-storage: Fatal error compiling: Unknown error trying
to execute the external compiler:
[ERROR] /bin/sh -c cd <http://jenkins.buildacloud.org/job/build-4.5/ws/engine/storage>
&& /usr/lib/jvm/java-1.7.0-openjdk-1.7.0.79-2.5.5.1.el7_1.x86_64/jre/../bin/javac
@/tmp/org.codehaus.plexus.compiler.javac.JavacCompiler7233006433514636140arguments -J-Xmx512m
-J-Xms128m
[ERROR] -> [Help 1]
[ERROR] Failed to execute goal org.apache.maven.plugins:maven-surefire-plugin:2.12:test (default-test)
on project cloud-plugin-user-authenticator-saml2: Error occurred in starting fork, check output
in log -> [Help 1]
[ERROR] Failed to execute goal org.apache.maven.plugins:maven-compiler-plugin:2.5.1:compile
(default-compile) on project cloud-plugin-network-globodns: Fatal error compiling: Unknown
error trying to execute the external compiler:
[ERROR] /bin/sh -c cd <http://jenkins.buildacloud.org/job/build-4.5/ws/plugins/network-elements/globodns>
&& /usr/lib/jvm/java-1.7.0-openjdk-1.7.0.79-2.5.5.1.el7_1.x86_64/jre/../bin/javac
@/tmp/org.codehaus.plexus.compiler.javac.JavacCompiler4853461010954385611arguments -J-Xmx512m
-J-Xms128m
[ERROR] -> [Help 1]
[ERROR] 
[ERROR] To see the full stack trace of the errors, re-run Maven with the -e switch.
[ERROR] Re-run Maven using the -X switch to enable full debug logging.
[ERROR] 
[ERROR] For more information about the errors and possible solutions, please read the following
articles:
[ERROR] [Help 1] http://cwiki.apache.org/confluence/display/MAVEN/MojoExecutionException
[ERROR] 
[ERROR] After correcting the problems, you can resume the build with the command
[ERROR]   mvn <goals> -rf :cloud-plugin-network-vxlan

Mime
View raw message